program: Gaussian 09
title: 000121458
version: EM64L-G09RevD.01
frameworkgroup: C1[X(C9H8ClNO2S)]
method: RPBEPBE
basis: SDD
operation: Freq
keyword: #p
keyword: freq=noraman
keyword: PBEPBE/SDD
title: #p freq=noraman PBEPBE/SDD
converged: YES YES NO NO
title: Mulliken charges:
elementType: Cl S O O N C C C C C C C C C H H H H H H H H
charge: 0.000499 0.887606 -0.545232 -0.516415 0.029374 -0.556159 -0.034284 -0.393675 -0.265218 -0.264768 -0.199608 -0.199722 -0.213006 -0.025652 0.307500 0.305353 0.360973 0.293634 0.290944 0.247674 0.246996 0.243186
chargesum: 0.00000
title: Mulliken charges with hydrogens summed into heavy atoms:
elementType: Cl S O O N C C C C C C C C C
charge: 0.000499 0.887606 -0.545232 -0.516415 0.029374 0.056694 -0.034284 -0.032702 0.028416 0.026176 0.048066 0.047273 0.030180 -0.025652
polarizability: 1.88096412e+02 -1.09294866e+01 1.33751920e+02 7.33095983e+00 1.48896494e+01 1.03235755e+02
1716.lowfreq: -12.5240 -6.9746 0.0016 0.0020 0.0023 3.2210 18.6181 26.6369 39.5602
frequency: 18.5796 26.5299 39.5568 63.4210 109.6932 144.3272 168.7901 181.4137 215.7675 240.1741 243.1142 248.1816 337.9148 355.0832 403.9457 435.3610 462.5744 473.7394 536.0269 573.1476 601.3531 655.0725 690.1635 695.7714 761.5342 784.6746 807.0670 852.6395 901.3407 936.2834 975.5630 979.6713 985.3520 1007.6184 1008.7207 1045.6647 1077.5970 1086.9252 1114.8477 1168.4021 1175.3539 1178.0438 1217.9906 1302.5659 1340.2258 1383.4398 1409.5984 1436.3737 1452.0609 1575.2201 1603.6636 2204.7682 3037.3224 3069.2843 3140.2920 3147.4682 3154.8552 3164.8553 3172.2429 3176.2308
redmass: 7.3266 6.0225 6.6261 6.4672 10.4492 6.7218 6.4224 14.4621 8.0425 4.6092 9.1229 4.4772 6.2359 9.6815 2.8295 10.4380 11.2599 4.4517 5.1273 5.5411 6.4829 6.8426 2.4735 6.1286 1.4292 5.9472 3.0644 1.2435 4.7693 1.3532 3.9336 3.6766 1.3953 3.9395 1.3753 2.1251 1.5547 3.7736 1.1848 1.1012 1.0583 1.1244 1.1877 1.3053 1.3720 8.1644 1.1008 2.2404 2.0216 5.7761 6.9000 12.5602 1.0840 1.0560 1.0860 1.0885 1.0928 1.0970 1.1127 1.1017
irintensity: 0.4517 0.4173 0.5595 4.1236 2.4981 0.4018 15.2564 0.9534 2.4144 4.8386 2.9868 7.6351 5.0930 20.9330 0.0046 69.9849 16.4034 44.0699 28.4860 16.1701 0.0118 9.2680 26.9964 40.2994 82.3334 53.2671 19.2657 0.8809 27.3714 1.8670 32.4862 31.0725 0.0837 0.6149 0.5512 28.2000 3.5402 37.2641 9.5195 7.2359 0.1035 5.5779 2.7584 3.8330 2.3202 6.2862 11.1369 17.1172 14.6474 3.1550 0.5147 1.8013 13.8768 4.5143 1.2354 7.4228 0.2625 4.2141 0.3714 25.2394
temp: 298.150 k
press: 1.00000 atm
elementType: 17 16 8 8 7 6 6 6 6 6 6 6 6 6 1 1 1 1 1 1 1 1
symmnumber: 1
zpe: 393305.0 jmol-1
zpe.correction: 0.149802 hartree
zpe.thermalcorrener: 0.164226 hartree
zpe.thermalcorrenthalpy: 0.165170 hartree
zpe.thermalcorrgfe: 0.105357 hartree
zpe.sumelectzpe: -1409.865393 hartree
zpe.sumelectthermal: -1409.850969 hartree
zpe.sumelectthermalent: -1409.850025 hartree
zpe.sumelectthermalfe: -1409.909838 hartree
dipole: -6.4745 5.2315 -2.2716
dipole: 8.6283
quadrupole: -93.3420 -107.0209 -97.1616
quadrupole: 2.5520 4.6859 5.2496
quadrupole: 5.8328 -7.8461 2.0132 2.5520 4.6859 5.2496
hfenergy: -1410.0151949 hartree
pointgroup: C01[X(C9H8Cl1N1O2S1)]
dipole: 2.7835354 1.4259226 1.319955 debye
dipolederiv: -0.426264 0.1864812 0.0767171 0.2544006 -0.5356355 -0.1510122 0.0311957 -0.1629217 -0.1542245 1.780345 -0.0137921 0.004452 -0.1264148 1.1627891 0.124743 -0.0898703 0.1631693 1.1920494 -0.7717194 0.0418323 -0.0255645 0.0922514 -0.4875169 0.0994987 0.0088842 -0.033876 -0.6544292 -0.6777728 -0.0196238 -0.003892 0.0701574 -0.6814191 -0.0841253 0.0293535 0.0493043 -0.453763 -0.1408395 0.0471417 -0.0099806 0.0432343 -0.0916594 0.0019819 0.0080944 0.014637 -0.1794353 -0.2228835 0.0323312 0.0356699 -0.1173701 -0.1087902 -0.0247207 -0.1195873 -0.0648833 -0.1385422 0.0149823 -0.0024173 0.0137241 0.0317738 -0.1360151 -0.0570708 0.0730547 -0.0755017 -0.1603305 0.6572621 -0.2256591 -0.1304226 -0.1748587 0.7063978 0.2183013 0.2252539 0.1384388 0.212813 -0.2455489 0.1124805 -0.0724288 -0.1906353 -0.0431129 -0.0763073 0.0934014 0.0352062 -0.0949631 -0.2542714 -0.0809201 0.0709576 0.1533967 -0.0823507 0.0344772 -0.1384911 -0.0748916 -0.0642585 -0.0369368 -0.1073939 0.1110478 -0.005998 -0.0116547 -0.0825899 0.0381731 -0.1128607 -0.0213848 -0.0448606 0.1362542 -0.0651766 0.0394596 0.0418595 -0.0993034 0.0041475 -0.0644566 -0.0707492 0.1273603 0.0541391 0.0713649 0.0409412 -0.0448859 -0.041145 0.0662668 -0.0400152 -0.0716991 -0.1560477 -0.0432305 -0.0094131 0.0136646 -0.1304057 -0.0328438 0.0127963 -0.0277204 -0.0491904 0.0469 0.0331816 0.0378047 0.070162 0.0312486 -0.0013365 0.0130501 0.0248332 0.0224524 -0.0171082 -0.0140505 0.0268501 -0.0625193 0.0307864 -0.0310875 -0.0221148 -0.0183482 0.0692483 0.1547943 -0.0286342 0.0255205 -0.027491 0.0225835 -0.0620341 -0.078077 -0.0072196 0.0797824 0.1398733 -0.0661546 0.0217049 -0.0371608 0.0833649 0.0425238 0.0206564 0.0144665 0.1389746 0.1340175 0.0398225 -0.054765 0.0340523 0.1043317 0.0306816 -0.0364802 0.0514296 0.1026139 0.010802 0.0336077 -0.0730244 0.0332099 0.0479067 0.0932743 -0.0831189 0.0939139 0.0685524 0.0107187 -0.0750747 0.0068909 -0.0903214 0.0111844 0.0815853 0.0037537 0.0812427 0.103924 -0.0828026 -0.0403214 -0.0580367 -0.0439345 0.1109935 0.0165095 -0.0603422 0.0160535 0.1225592 unknown
polarizability: 189.6393715|1.5577174|137.013989|8.5343228|-8.4320635|98.4307262 unknown
InChI: InChI=1S/C9H8ClNO2S/c10-8(6-11)7-14(12,13)9-4-2-1-3-5-9/h1-5,8H,7H2
charge 0 multiplicity 1
22 atoms
Cl -3.34237 2.494277 0.835543
S  -0.312163 -0.56018 -0.601115
O  -0.594935 0.144891 -2.057119
O  -0.603421 -2.139188 -0.311905
N  -4.591121 -0.891381 -0.103253
C  -1.396472 0.508109 0.674448
C  1.479553 -0.189853 -0.104456
C  -2.664939 0.934969 -0.052201
C  2.10871 -1.087243 0.772795
C  2.106801 0.924412 -0.684701
C  3.456694 -0.824632 1.113099
C  3.45456 1.167752 -0.33022
C  4.120735 0.300288 0.568468
C  -3.724163 -0.07299 -0.074804
H  -1.550867 -0.15328 1.538183
H  -0.754699 1.370433 0.906395
H  -2.427316 1.277407 -1.076239
H  1.575295 -1.967087 1.14795
H  1.575557 1.553549 -1.406863
H  3.985264 -1.50061 1.79284
H  3.982185 2.024322 -0.761927
H  5.165311 0.494134 0.834482
