program: Gaussian 09
title: 000014532
version: EM64L-G09RevD.01
frameworkgroup: C1[X(C8H12N2O)]
method: RPBEPBE
basis: SDD
operation: Freq
keyword: #p
keyword: freq=noraman
keyword: PBEPBE/SDD
title: #p freq=noraman PBEPBE/SDD
converged: YES YES NO NO
title: Mulliken charges:
elementType: O N N C C C C C C C C H H H H H H H H H H H H
charge: -0.278348 -0.688910 -0.695211 0.380379 0.315673 0.234251 -0.543913 -0.384568 -0.348999 -0.236840 -0.688991 0.236900 0.238113 0.207984 0.202064 0.201474 0.202814 0.229477 0.229626 0.308455 0.295422 0.289913 0.293235
chargesum: 0.00000
title: Mulliken charges with hydrogens summed into heavy atoms:
elementType: O N N C C C C C C C C
charge: -0.278348 -0.085033 -0.112062 0.380379 0.315673 0.234251 -0.307012 -0.146455 -0.141015 0.166698 -0.027074
polarizability: 1.61504433e+02 -4.46662804e+00 1.09717008e+02 -4.89943866e-01 1.43491962e+00 5.59731549e+01
1716.lowfreq: -0.0003 0.0006 0.0008 4.4472 9.9625 15.3694 55.6925 105.8652 136.7339
frequency: 55.6095 105.8610 136.7322 152.1078 194.8278 224.7898 247.7678 292.4129 312.3950 336.5620 362.0110 435.8001 448.3783 465.3208 532.1964 571.7292 576.3469 604.1613 620.4486 718.9750 723.6714 763.4317 769.3641 829.2115 848.6027 870.6987 887.2608 961.4066 1031.5238 1053.4148 1075.7648 1116.7807 1136.9370 1147.4809 1170.7324 1253.1084 1259.1109 1288.2375 1316.0761 1366.2315 1395.8031 1408.7770 1456.1278 1460.2869 1479.4301 1492.1276 1521.9540 1594.1069 1609.0913 1637.2701 1647.4889 2944.1031 2994.1833 2998.7655 3091.2077 3102.5765 3116.6300 3145.2310 3167.2807 3477.4511 3507.5377 3621.7299 3657.7367
redmass: 3.9615 1.7269 3.3527 3.9344 1.1980 2.3118 1.3349 3.3986 3.5219 4.0401 4.3057 2.7125 3.7985 1.1662 1.4990 2.4487 5.4195 1.7956 1.9028 3.1415 4.8238 3.8833 1.5401 1.0984 1.6394 3.2402 1.3472 2.7390 2.0115 1.9816 1.3516 2.1694 1.4356 1.3739 2.0898 3.4477 1.1472 1.4026 3.0885 1.3659 1.3190 4.7126 3.4105 1.0407 1.0738 1.1211 3.7435 4.0078 1.6453 1.1430 3.1972 1.0552 1.0360 1.1071 1.0988 1.1011 1.0893 1.0916 1.0935 1.0470 1.0460 1.0975 1.1003
irintensity: 4.1963 3.0999 2.4591 0.6442 13.5657 5.7151 0.1393 2.7758 0.3641 2.2711 28.4433 28.7915 0.8094 48.8911 221.1561 58.8096 3.3324 189.9718 153.3146 6.9753 10.7899 6.0392 51.7158 0.9742 48.6212 6.8589 3.4883 31.3783 19.6248 33.6797 23.3265 5.6222 4.2843 94.1063 174.3305 76.2823 0.3430 7.3900 17.2127 13.5005 16.6155 73.7304 24.6150 11.0727 13.8226 17.0525 261.2673 14.4943 59.1333 107.1116 108.0203 46.0947 30.2418 44.3120 32.7012 38.1604 27.7969 8.5024 11.7256 6.3233 25.6707 15.5814 19.8464
temp: 298.150 k
press: 1.00000 atm
elementType: 8 7 7 6 6 6 6 6 6 6 6 1 1 1 1 1 1 1 1 1 1 1 1
symmnumber: 1
zpe: 501177.7 jmol-1
zpe.correction: 0.190889 hartree
zpe.thermalcorrener: 0.202332 hartree
zpe.thermalcorrenthalpy: 0.203276 hartree
zpe.thermalcorrgfe: 0.154223 hartree
zpe.sumelectzpe: -495.936186 hartree
zpe.sumelectthermal: -495.924743 hartree
zpe.sumelectthermalent: -495.923799 hartree
zpe.sumelectthermalfe: -495.972851 hartree
dipole: -1.3646 -0.7879 0.1030
dipole: 1.5791
quadrupole: -48.5483 -56.3221 -70.7604
quadrupole: -3.5222 -1.3443 -1.5349
quadrupole: 9.9953 2.2215 -12.2168 -3.5222 -1.3443 -1.5349
hfenergy: -496.1270746 hartree
pointgroup: C01 [X(C8H12N2O1)]
dipole: -0.5393631 0.3077988 -0.0178286 debye
dipolederiv: -1.9536724 -0.0013696 0.064657 0.0739201 -0.3420743 -0.0040433 0.0620052 -0.0087603 -0.2864902 -0.8957603 -0.595015 -0.1553093 -0.6261283 -0.7292755 0.0450701 -0.2709278 -0.1297937 -0.6001189 -1.2673178 0.1557363 0.1831031 0.073098 -0.255847 0.203938 0.3387397 0.0972114 -0.4921416 1.4671059 -0.0297873 -0.0572948 -0.5448872 0.2361745 0.0290565 -0.0665147 0.0303226 0.0853529 0.6607165 0.5413853 0.0299225 0.9058172 0.7323591 -0.0261534 0.0436602 -0.0620728 0.0546365 1.0209032 -0.2229393 -0.0833586 -0.5969334 -0.2558457 -0.0481925 0.005232 -0.0661949 -0.0254756 -0.4707749 -0.1882097 0.0068461 -0.0827928 -0.0273388 0.0021387 0.0527845 0.0476827 -0.2410892 -0.4151464 -0.1407209 -0.0008537 0.3627279 -0.1705103 -0.0044825 -0.005415 0.0014341 -0.2551591 0.1266097 0.2046763 0.0115241 -0.0997436 0.1499466 0.0041614 -0.1008456 0.0227472 -0.1696915 0.9626045 0.1232076 -0.0162609 0.5258929 0.3370177 -0.0221602 -0.0023782 -0.0099607 0.4064054 -0.1398405 0.0655248 0.0106291 0.0325954 0.0512287 -0.001331 0.0097771 -0.0032637 0.0578222 0.0830719 0.0305308 -0.0005514 0.0419202 -0.0875795 0.0003304 -0.0100145 -0.0055887 0.1800756 -0.0168704 -0.1017714 0.0024136 -0.1224322 0.0049976 -0.0021034 0.0110762 -0.0107359 0.1792399 0.0288007 0.0931318 0.0059518 0.0862984 -0.1185509 0.0022413 0.015273 0.0034677 0.1558149 -0.0326946 0.0427488 -0.0492004 -0.1028442 -0.0677422 0.1155933 -0.0006106 0.1233102 -0.0901634 -0.0287089 0.0272545 0.0458012 -0.1132258 -0.0510195 -0.1045447 -0.0137829 -0.1232566 -0.1119294 -0.1113266 -0.0995382 0.004961 -0.1451507 -0.0253264 0.0002102 0.0032412 -0.0014855 0.1109208 0.0966851 0.0069188 -0.0032883 0.074849 0.0048501 0.1093902 -0.039291 0.1172174 -0.0550123 0.0985738 -0.0019781 -0.0098545 0.0631722 0.0231507 -0.1083412 0.031802 -0.1108471 -0.0757684 0.2274098 0.0224204 0.0710728 0.0238941 0.1992511 -0.0401522 0.1751022 0.0631111 0.2923665 0.1680458 0.0808297 0.0387388 0.0523177 0.1390398 0.012388 0.063279 0.0819608 0.3416915 0.1945189 -0.0315982 -0.0480489 0.0278543 0.0687378 -0.0520294 -0.0669933 0.0051368 0.3241695 0.197067 0.0185627 -0.0516006 0.0897806 0.1843564 -0.1109842 -0.2351989 -0.061642 0.2145437 unknown
polarizability: 161.3635096|4.7849041|109.7227788|-3.2218048|1.875398|56.108308 unknown
InChI: InChI=1S/C8H12N2O/c1-2-11-6-3-4-7(9)8(10)5-6/h3-5H,2,9-10H2,1H3
charge 0 multiplicity 1
23 atoms
O  2.060744 -0.583551 -0.193465
N  -2.632389 -1.81157 -0.021578
N  -3.427549 0.828447 0.023272
C  0.725297 -0.128257 -0.127512
C  -1.625592 -0.829213 -0.050626
C  -2.030739 0.548605 -0.030526
C  -0.253027 -1.151683 -0.118871
C  0.342453 1.23146 -0.057162
C  -1.039039 1.549243 -0.023781
C  3.120312 0.436747 -0.1988
C  4.452163 -0.305656 -0.284069
H  0.081014 -2.194836 -0.138692
H  1.080651 2.03757 -0.047335
H  -1.344813 2.603225 -0.006952
H  2.982179 1.113193 -1.068518
H  3.058947 1.044232 0.72882
H  5.290931 0.414446 -0.288723
H  4.575376 -0.982217 0.579002
H  4.502347 -0.909066 -1.206634
H  -3.506896 -1.559678 0.441561
H  -2.358576 -2.791351 0.009956
H  -3.692359 1.80025 0.184609
H  -4.015537 0.337358 -0.655574
