program: Gaussian 09
title: 000121428
version: EM64L-G09RevD.01
frameworkgroup: C1[X(C19H20N2O4)]
method: RPBEPBE
basis: SDD
operation: Freq
keyword: #p
keyword: freq=noraman
keyword: PBEPBE/SDD
title: #p freq=noraman PBEPBE/SDD
converged: NO YES NO NO
title: Mulliken charges:
elementType: O O O O N N C C C C C C C C C C C C C C C C C C C H H H H H H H H H H H H H H H H H H H H
charge: -0.204189 -0.203003 -0.432909 -0.432607 -0.253952 -0.249640 -0.339732 -0.390401 0.116746 0.119656 -0.355717 -0.350079 0.525041 0.526562 -0.697125 -0.536705 -0.530861 -0.427129 -0.426556 0.332391 0.330495 -0.174638 -0.173425 -0.380434 -0.380087 0.289585 0.227885 0.230709 0.202259 0.212547 0.196717 0.199576 0.213637 0.209543 0.218716 0.262248 0.261275 0.283172 0.281462 0.232886 0.233027 0.257649 0.257735 0.358792 0.358876
chargesum: 0.00000
title: Mulliken charges with hydrogens summed into heavy atoms:
elementType: O O O O N N C C C C C C C C C C C C C C C C C C C
charge: -0.204189 -0.203003 -0.074116 -0.073731 -0.253952 -0.249640 -0.050148 0.068193 0.116746 0.119656 0.059089 0.046215 0.525041 0.526562 -0.055229 -0.274457 -0.269586 -0.143957 -0.145094 0.332391 0.330495 0.058248 0.059602 -0.122785 -0.122352
polarizability: 2.62442172e+02 1.63372216e+01 2.35653295e+02 2.13184985e+01 -2.41456967e+01 2.03300902e+02
1716.lowfreq: 0.0005 0.0006 0.0007 4.3877 5.1802 7.0254 22.2727 23.8757 37.6991
frequency: 22.0133 23.6468 37.6698 40.5823 52.0642 57.0808 66.8766 73.1428 109.1819 114.5879 124.4052 186.5008 201.0892 205.5522 219.7437 226.6428 232.4947 248.1175 253.1014 288.0474 302.8020 344.4248 354.4714 364.1314 369.3341 378.6050 415.5471 429.6006 443.4349 447.0216 460.3220 484.5241 516.9271 517.2426 567.8196 568.1678 589.6313 610.1122 635.6412 655.6933 675.1528 680.8332 695.4291 733.4454 753.1285 779.8285 785.7265 786.7928 803.6349 821.1356 843.1206 847.7186 882.3534 884.8795 896.6398 904.7123 926.3817 929.0597 971.1347 971.6037 982.9511 983.7684 987.0596 1002.5062 1056.1265 1065.2571 1079.9710 1087.4323 1100.6378 1109.8592 1115.2005 1135.1109 1145.7104 1156.6366 1173.4708 1174.1629 1188.7499 1203.2162 1205.6190 1232.3933 1236.4198 1239.6521 1281.8922 1290.7148 1295.0329 1302.9135 1309.8466 1318.7570 1330.0043 1339.5993 1363.0627 1390.8435 1395.0883 1398.0654 1443.7455 1450.4676 1453.5198 1465.8581 1474.7255 1477.8513 1486.1073 1489.6468 1493.8851 1602.6174 1607.1312 1613.3282 1613.9194 1639.8031 1669.2609 2960.5628 2970.3935 2974.0975 2994.3303 3002.9846 3006.9006 3028.1881 3062.6696 3071.5589 3073.9432 3143.8659 3144.5355 3148.3622 3148.4001 3178.8902 3179.0833 3198.0535 3199.5562 3581.2842 3581.3693
redmass: 4.7855 5.0835 5.6694 4.9427 4.6461 1.6380 5.6839 6.7125 4.1350 4.1569 3.2286 5.5651 3.1007 2.7153 3.3630 4.4018 1.4624 4.1375 4.5749 7.9329 6.8973 7.2682 1.1532 1.1698 3.9963 4.6117 4.9441 4.2655 3.6572 3.1322 3.8011 5.6431 7.5051 7.3610 5.6125 7.5136 5.2087 5.6458 7.5059 5.9845 2.4851 2.2544 2.3352 1.1723 5.9454 1.6987 1.4636 1.5466 2.9611 4.3807 1.6079 1.5578 1.4968 1.4172 2.3926 1.9149 2.7364 2.3440 1.3417 1.3341 6.0181 5.7881 2.2166 3.1077 2.5796 2.3621 1.6199 2.0012 1.9426 1.9761 2.6749 1.5754 1.4661 1.6708 1.1111 1.0989 1.5259 2.3596 1.4730 3.6357 2.3911 1.6515 1.3542 1.1795 1.8836 1.2662 3.6002 1.5068 1.8019 1.4180 1.5751 1.2173 8.8601 8.0197 3.0839 1.0911 3.3331 1.0723 1.0697 1.0423 1.0797 2.5529 2.6106 6.5280 6.4184 6.4979 6.3969 12.0963 11.8449 1.0586 1.0596 1.0363 1.0649 1.0992 1.0759 1.1035 1.1041 1.1013 1.0992 1.0917 1.0915 1.0885 1.0886 1.0950 1.0951 1.0961 1.0959 1.0661 1.0661
irintensity: 0.5117 0.1666 0.0639 0.3501 0.3939 0.0137 0.4284 2.7982 2.3591 2.9655 0.1795 0.8620 1.5464 0.2259 0.6844 2.7428 0.3070 3.1899 2.2251 7.8390 8.1678 7.9472 177.1668 66.8294 5.3489 1.5251 2.6112 19.0416 11.0696 2.5009 11.8806 53.8550 2.6051 1.1256 11.9322 5.2728 0.5017 3.6277 4.8665 0.4752 19.9546 11.2509 24.6885 5.8501 10.5207 0.8219 17.6180 66.3098 10.6594 2.5522 50.1152 37.4717 4.2048 0.5559 9.5152 13.2849 2.1196 11.0052 0.5853 1.5918 0.1792 2.8647 3.6915 12.2946 2.5050 0.9781 51.7031 0.4631 2.2401 28.8765 75.1488 143.2970 216.3237 75.6500 0.9628 2.7210 1.8923 49.4094 0.6648 375.0858 30.5561 8.0198 26.0545 4.1086 1.6452 0.4015 108.6909 44.7816 14.7392 9.5385 2.3757 9.9839 1.4948 22.3731 30.5429 17.3309 56.0969 0.6546 5.1698 13.0941 15.0464 37.8652 92.5831 74.1605 155.4254 71.7899 61.9537 319.4734 199.6105 4.0643 52.0784 30.7857 38.9000 0.1913 12.7955 16.4947 4.6862 84.4903 56.2026 5.4482 2.1293 15.6160 5.8084 6.4788 5.8453 0.4486 0.5031 33.7502 33.4899
temp: 298.150 k
press: 1.00000 atm
elementType: 8 8 8 8 7 7 6 6 6 6 6 6 6 6 6 6 6 6 6 6 6 6 6 6 6 1 1 1 1 1 1 1 1 1 1 1 1 1 1 1 1 1 1 1 1
symmnumber: 1
zpe: 927819.7 jmol-1
zpe.correction: 0.353388 hartree
zpe.thermalcorrener: 0.377072 hartree
zpe.thermalcorrenthalpy: 0.378016 hartree
zpe.thermalcorrgfe: 0.298338 hartree
zpe.sumelectzpe: -1144.594239 hartree
zpe.sumelectthermal: -1144.570554 hartree
zpe.sumelectthermalent: -1144.569610 hartree
zpe.sumelectthermalfe: -1144.649289 hartree
dipole: 0.4300 0.4819 0.5295
dipole: 0.8352
quadrupole: -148.3231 -158.5615 -138.5853
quadrupole: 4.1366 -5.0363 -4.2811
quadrupole: 0.1669 -10.0716 9.9047 4.1366 -5.0363 -4.2811
hfenergy: -1144.9476265 hartree
pointgroup: C01 [X(C19H20N2O4)]
dipole: -0.174237 0.1958534 -0.1981331 debye
polarizability: 263.7648129|-15.5061871|238.7899569|17.9031947|23.4092671|198.8415995 unknown
InChI: InChI=1S/C19H20N2O4/c1-2-3-10-17-18(24)20(13-6-4-8-15(22)11-13)21(19(17)25)14-7-5-9-16(23)12-14/h4-9,11-12,17,22-23H,2-3,10H2,1H3
charge 0 multiplicity 1
45 atoms
O  1.056036 -3.106575 -0.108535
O  2.267399 1.011399 2.148022
O  -4.76998 -0.551796 1.3043
O  -1.753728 3.116829 -2.474103
N  0.03447 -0.991459 0.236174
N  0.391115 0.235478 0.919791
C  2.170646 -1.311464 1.228256
C  3.585447 -1.308827 0.586263
C  1.08178 -1.943519 0.362153
C  1.663457 0.097033 1.53652
C  3.665747 -0.565345 -0.765053
C  5.095228 -0.583464 -1.352056
C  -1.347124 -1.318766 0.001785
C  -0.178439 1.490376 0.504375
C  5.19398 0.139437 -2.712464
C  -2.36235 -0.744004 0.805716
C  -0.679894 1.645722 -0.811414
C  -1.667162 -2.238896 -1.025994
C  -0.202897 2.56646 1.423955
C  -3.709482 -1.090492 0.55882
C  -1.223958 2.892303 -1.193654
C  -3.022394 -2.583797 -1.23133
C  -0.729254 3.808631 1.002552
C  -4.051614 -2.013619 -0.456252
C  -1.25007 3.98372 -0.294892
H  2.222251 -1.897733 2.167443
H  3.892853 -2.3634 0.452504
H  4.27982 -0.844009 1.311687
H  2.969814 -1.033407 -1.491299
H  3.341264 0.487415 -0.636071
H  5.428663 -1.63526 -1.465115
H  5.79047 -0.110484 -0.629227
H  4.893781 1.200255 -2.62124
H  4.532754 -0.333941 -3.462654
H  6.225686 0.113773 -3.108293
H  -2.102599 -0.04384 1.606899
H  -0.643328 0.810036 -1.518744
H  -0.874162 -2.689286 -1.624897
H  0.203226 2.438784 2.428714
H  -3.276842 -3.303502 -2.016296
H  -0.740456 4.649289 1.704031
H  -5.104021 -2.261946 -0.618134
H  -1.674959 4.935667 -0.624616
H  -4.445012 0.107981 1.966151
H  -1.731663 2.292441 -3.020779
