program: Gaussian 09
title: 000121431
version: EM64L-G09RevD.01
frameworkgroup: C1[X(C19H32N2O4)]
method: RPBEPBE
basis: SDD
operation: Freq
keyword: #p
keyword: freq=noraman
keyword: PBEPBE/SDD
title: #p freq=noraman PBEPBE/SDD
converged: YES YES NO NO
title: Mulliken charges:
elementType: O O O O N N C C C C C C C C C C C C C C C C C C C H H H H H H H H H H H H H H H H H H H H H H H H H H H H H H H H
charge: -0.291502 -0.285269 -0.235378 -0.258796 -0.104261 -0.409769 -0.422567 -0.369482 -0.009497 -0.353350 -0.321835 -0.320075 -0.707615 -0.673287 -0.677001 0.137656 0.377956 -0.538753 -0.557973 0.293669 0.224548 0.055783 -0.534095 -0.537674 -0.517534 0.202812 0.180157 0.201004 0.223487 0.246397 0.198929 0.174592 0.202982 0.182975 0.182468 0.200680 0.214072 0.248195 0.197195 0.292938 0.205682 0.229869 0.207514 0.203655 0.232113 0.207395 0.230361 0.287047 0.230962 0.229389 0.241149 0.216477 0.249659 0.215931 0.230768 0.213627 0.255621
chargesum: 0.00000
title: Mulliken charges with hydrogens summed into heavy atoms:
elementType: O O O O N N C C C C C C C C C C C C C C C C C C C
charge: -0.291502 -0.285269 -0.235378 -0.258796 -0.104261 -0.116831 -0.039598 0.055009 0.236900 0.020170 0.064123 0.063072 -0.048153 -0.030222 -0.033838 0.137656 0.377956 -0.308392 -0.270925 0.293669 0.224548 0.055783 0.167405 0.144393 0.182482
polarizability: 3.06006507e+02 -2.23078050e+01 2.55882005e+02 -2.92207102e+01 -1.85065849e+01 1.89644563e+02
1716.lowfreq: -5.5125 -2.8715 -0.0008 -0.0005 0.0007 4.3509 8.3690 15.9901 18.9138
frequency: 7.9281 13.1502 17.2554 35.2309 47.0187 57.1530 60.4830 70.5099 72.3109 78.4543 89.2443 100.4126 108.0312 108.7607 126.9815 157.5677 163.5479 170.4517 181.7832 191.7093 198.4856 200.9279 213.9245 224.2805 225.6452 235.0605 254.9394 280.2563 285.7937 286.0268 301.8178 311.6955 318.4052 351.9750 358.8800 407.3234 414.3419 426.7571 444.0010 467.7096 483.9531 500.5606 508.8161 524.4187 549.6120 581.3445 584.3645 652.5246 693.2490 732.4331 735.7059 740.6726 763.3916 772.8010 793.4282 797.4974 824.8726 834.2324 869.8015 875.6260 887.7839 912.0861 918.9852 947.4567 953.3416 981.4639 994.7117 1004.1111 1029.1990 1056.4303 1074.2801 1081.4966 1086.1077 1086.5713 1088.9637 1105.1753 1108.1754 1110.6291 1111.2055 1113.4170 1137.6836 1147.9352 1150.4408 1156.2509 1156.5569 1167.9455 1196.3022 1205.3050 1212.5084 1222.6875 1248.2331 1256.2856 1278.3809 1280.5391 1289.8295 1294.1006 1304.1961 1316.8541 1341.3274 1355.3167 1360.1615 1364.7109 1377.4099 1380.8166 1385.6577 1386.1322 1386.5471 1407.1492 1419.9977 1441.3957 1444.9949 1452.7223 1457.9535 1458.8464 1461.2420 1461.8993 1466.4304 1467.0762 1468.9166 1469.7903 1471.8090 1472.9228 1475.6827 1478.2802 1479.5699 1481.2000 1484.4870 1486.9510 1490.5794 1499.7930 1567.2585 1589.5653 1601.9865 2825.8177 2839.3599 2853.4124 2943.4115 2950.7884 2969.2161 2975.7448 2978.2320 2982.5005 2983.1934 2985.5686 3010.5410 3020.1159 3025.5457 3031.1290 3034.5994 3036.6262 3055.0988 3060.6107 3072.7561 3073.9520 3075.4211 3084.4828 3092.1048 3092.3976 3093.3393 3124.3228 3127.0735 3127.7907 3149.3670 3171.1969 3539.5179
redmass: 4.6315 4.4291 3.1461 5.7513 3.6613 3.5326 2.6324 2.7957 3.3654 2.0142 2.5898 2.5349 3.5307 2.4795 2.5262 2.3957 1.6215 2.0870 2.3178 2.0805 1.6095 1.5886 2.9065 1.1764 2.7795 1.8582 1.3209 2.5436 1.7425 2.0250 3.9927 2.7471 5.1639 4.1181 3.3464 4.5970 3.0644 3.4418 2.8077 3.7583 3.2912 3.5935 2.4310 7.0932 1.5585 4.5778 3.8092 4.1801 5.7398 3.6056 1.4033 1.9896 4.2339 4.2843 1.1368 1.2074 1.6801 1.6310 4.9985 2.0564 1.6886 2.5278 2.2853 2.6077 8.8115 2.0478 2.4622 2.4810 3.6930 2.6009 1.9243 2.1673 2.3711 2.0410 5.6883 2.4429 1.2756 1.3270 1.6883 1.3711 1.8941 1.8191 1.4564 1.4553 1.4987 1.9426 2.8418 2.3077 1.8421 1.6502 1.7724 1.3123 1.3213 1.1475 1.2230 1.1921 2.0218 1.7171 1.5808 1.4431 1.3316 1.3530 1.4172 1.2384 4.5801 1.2434 1.2351 3.2551 1.2586 1.2212 1.3477 1.3098 1.0825 1.0701 1.1350 1.0551 1.0500 1.0641 1.1297 1.0693 1.0689 1.0778 1.0530 1.0608 1.1342 1.1386 1.1503 1.0763 1.0741 2.4766 7.7498 5.9137 8.3471 1.0715 1.0723 1.0712 1.0647 1.0337 1.0322 1.0364 1.0329 1.0358 1.0359 1.0617 1.0904 1.0858 1.0869 1.0874 1.0870 1.1037 1.1019 1.1043 1.0986 1.0984 1.0978 1.0997 1.1003 1.0999 1.1002 1.0984 1.1007 1.1040 1.0898 1.0906 1.0767
irintensity: 0.0478 0.0153 0.1177 2.7502 0.0556 6.9215 1.9951 7.6679 1.0040 1.3769 2.2963 2.2616 0.2862 1.3545 3.4176 5.2350 2.9147 3.0415 6.0443 2.3595 0.4173 0.3496 3.0548 0.3313 12.8570 0.4370 1.8267 3.6189 0.1492 1.6657 1.6597 0.0495 5.4176 1.2358 2.7605 19.7659 1.8556 0.6318 2.8251 10.6749 5.4734 2.4589 24.1989 1.6551 93.3232 1.5718 6.2204 8.7027 32.1652 33.3398 8.7686 5.7685 11.8139 3.9102 4.4199 6.5683 7.6596 3.6057 0.6081 3.1212 23.7756 8.7238 2.3299 5.9352 41.1971 8.1523 3.2922 1.0895 2.2559 4.4173 13.5412 9.9878 49.3315 12.1907 308.9071 15.6632 20.0572 4.8213 22.0586 8.7741 7.3322 33.7488 15.3742 45.6672 47.5205 3.4761 93.7787 33.4221 48.0632 40.0197 30.4028 12.7258 3.8751 1.4716 16.0625 35.5295 124.8988 94.5547 67.8882 30.2796 5.6149 5.7892 0.9961 21.1677 18.6348 23.3218 20.5296 64.5406 27.7427 29.8887 11.1991 242.9490 4.3813 10.9755 94.0732 5.7767 11.9370 31.7557 34.0079 13.0085 24.8818 40.6997 9.5048 6.4407 92.3451 30.3200 12.8018 7.6161 13.2311 59.3752 278.7068 15.3869 15.2792 52.4863 35.7357 229.4995 33.8858 65.6796 56.5340 38.6577 83.8746 37.5680 29.0423 16.6290 23.9779 8.8070 25.3026 1.7992 16.4813 52.8722 58.6802 38.7305 48.3467 51.6747 91.7287 35.5961 30.7865 33.0589 43.9850 22.1512 22.8794 23.2372 10.8521 2.9796 7.2462
temp: 298.150 k
press: 1.00000 atm
elementType: 8 8 8 8 7 7 6 6 6 6 6 6 6 6 6 6 6 6 6 6 6 6 6 6 6 1 1 1 1 1 1 1 1 1 1 1 1 1 1 1 1 1 1 1 1 1 1 1 1 1 1 1 1 1 1 1 1
symmnumber: 1
zpe: 1272473.6 jmol-1
zpe.correction: 0.484660 hartree
zpe.thermalcorrener: 0.514649 hartree
zpe.thermalcorrenthalpy: 0.515594 hartree
zpe.thermalcorrgfe: 0.419633 hartree
zpe.sumelectzpe: -1151.587774 hartree
zpe.sumelectthermal: -1151.557784 hartree
zpe.sumelectthermalent: -1151.556840 hartree
zpe.sumelectthermalfe: -1151.652801 hartree
dipole: -2.0229 -1.1808 1.7531
dipole: 2.9257
quadrupole: -142.2065 -150.0264 -151.0637
quadrupole: 6.5023 -19.5184 3.8659
quadrupole: 5.5591 -2.2608 -3.2982 6.5023 -19.5184 3.8659
hfenergy: -1152.0724336 hartree
pointgroup: C01 [X(C19H32N2O4)]
dipole: 0.8089524 -0.4381556 -0.6917858 debye
polarizability: 304.5772311|23.8845516|257.1505021|-29.769442|17.8253387|189.8053423 unknown
InChI: InChI=1S/C19H32N2O4/c1-7-21(8-2)11-9-10-14(3)20-19(22)15-12-16(23-4)18(25-6)17(13-15)24-5/h12-14,20H,7-11H2,1-6H3
charge 0 multiplicity 1
57 atoms
O  -0.62147 2.660221 1.162591
O  -5.219836 0.278058 1.018815
O  -2.364771 -2.579033 -1.541789
O  -4.770976 -2.036361 -0.516051
N  5.024217 -0.92514 0.455905
N  0.48905 1.794017 -0.689385
C  2.937425 2.023685 -1.004943
C  3.361005 0.918884 -0.012399
C  1.623029 2.741329 -0.610434
C  4.5988 0.133509 -0.496815
C  6.477537 -1.232639 0.364835
C  4.175054 -2.144277 0.366609
C  1.356095 3.993545 -1.478987
C  7.36196 -0.156369 1.023586
C  4.161842 -2.967542 1.669033
C  -0.561396 1.808319 0.215984
C  -1.632118 0.766344 0.017239
C  -1.42605 -0.423558 -0.724194
C  -2.880291 1.011602 0.628022
C  -3.936581 0.087818 0.481169
C  -2.477405 -1.361554 -0.857742
C  -3.75188 -1.116169 -0.262519
C  -5.466404 1.530336 1.742236
C  -1.091589 -2.860405 -2.204982
C  -5.465724 -2.629298 0.647237
H  3.738045 2.786545 -1.07762
H  2.827121 1.59775 -2.027191
H  2.509363 0.230135 0.152341
H  3.593876 1.364177 0.973315
H  1.67158 3.054296 0.448976
H  5.437491 0.84451 -0.618638
H  4.396981 -0.289224 -1.516982
H  6.652164 -2.191976 0.884886
H  6.796905 -1.388063 -0.69829
H  4.486946 -2.795262 -0.491318
H  3.140628 -1.818674 0.151112
H  2.170316 4.731393 -1.356776
H  0.408502 4.471583 -1.177299
H  1.291446 3.729793 -2.552081
H  0.416241 1.212835 -1.526573
H  8.428873 -0.442749 0.964546
H  7.083523 -0.037431 2.085018
H  7.253064 0.827509 0.532089
H  3.500005 -3.847858 1.564247
H  3.79648 -2.345963 2.50457
H  5.168579 -3.337261 1.935336
H  -0.439682 -0.656085 -1.136313
H  -2.983966 1.933022 1.207088
H  -5.305848 2.406777 1.086322
H  -4.819686 1.613151 2.636354
H  -6.521982 1.480116 2.047208
H  -0.853862 -2.092369 -2.967603
H  -1.236078 -3.83461 -2.694418
H  -0.258818 -2.931302 -1.476843
H  -6.170967 -3.352903 0.211385
H  -4.741361 -3.155624 1.297737
H  -6.003201 -1.856559 1.220895
