program: Gaussian 09
title: 000121376
version: EM64L-G09RevD.01
frameworkgroup: C1[X(C14H19N3O4)]
method: RPBEPBE
basis: SDD
operation: Freq
keyword: #p
keyword: freq=noraman
keyword: PBEPBE/SDD
title: #p freq=noraman PBEPBE/SDD
converged: YES YES NO NO
title: Mulliken charges:
elementType: O O O O N N N C C C C C C C C C C C C C C H H H H H H H H H H H H H H H H H H H
charge: -0.247961 -0.206883 -0.212488 -0.216271 -0.073331 -0.371493 -0.375137 0.095023 -0.395704 -0.526824 0.135384 0.177078 -0.376215 -0.347953 -0.324017 -0.318446 -0.415076 -0.715934 0.014705 0.156621 -0.037465 0.228632 0.249077 0.285808 0.253641 0.286311 0.182839 0.189655 0.209152 0.216908 0.194519 0.193555 0.213187 0.236990 0.219712 0.227844 0.231124 0.227322 0.369447 0.366660
chargesum: 0.00000
title: Mulliken charges with hydrogens summed into heavy atoms:
elementType: O O O O N N N C C C C C C C C C C C C C C
charge: -0.247961 -0.206883 -0.212488 -0.216271 -0.073331 -0.002046 -0.008477 0.095023 0.082005 0.012625 0.135384 0.177078 0.092936 0.050855 0.087411 0.088296 0.041626 -0.029644 0.014705 0.156621 -0.037465
polarizability: 2.42266080e+02 1.04886785e+01 1.74687124e+02 -6.49385252e+00 -2.81559829e+00 1.38174752e+02
1716.lowfreq: -15.9778 -8.9607 -5.0089 -0.0004 0.0004 0.0005 10.7129 15.1220 34.6669
frequency: 5.3833 14.2604 34.6132 44.3096 65.6242 77.6293 93.2077 135.8175 139.8839 154.6765 160.8514 178.7134 202.5068 220.8391 242.5685 246.2283 281.1844 299.3305 306.3388 322.4892 357.5535 362.1565 365.7923 387.0406 401.8221 434.6308 466.8632 477.9751 487.6723 539.0281 590.9591 606.1711 628.0844 651.0015 681.6650 707.1361 716.0253 755.4878 757.4456 766.5410 788.0897 802.7935 813.1793 845.9397 867.7933 902.2401 936.2006 969.0284 973.9356 983.6551 991.9300 996.4662 1026.7300 1054.2967 1081.7143 1085.9179 1100.0689 1114.5747 1116.5071 1142.8305 1144.9271 1175.6000 1191.4648 1193.1115 1220.7529 1241.6963 1261.7422 1273.2217 1290.4716 1293.4447 1302.0732 1315.6620 1325.7171 1338.5958 1340.2940 1359.9851 1362.1406 1370.0599 1377.2144 1377.7526 1387.0343 1393.4991 1443.5680 1445.6022 1452.6522 1453.2027 1456.5218 1457.7535 1473.4717 1480.6906 1484.9814 1615.7112 1651.3164 1678.3550 2287.3812 2821.7887 2853.8630 2865.2926 2954.6065 2962.8044 2974.7156 2983.9961 2998.5035 3017.8922 3019.7074 3031.6704 3057.3283 3067.5298 3079.1816 3083.1771 3088.5128 3093.2341 3517.6604 3519.3291
redmass: 4.4171 6.9321 6.4383 3.9953 3.8779 4.1127 2.8410 6.3501 4.4325 7.2897 5.4623 3.0300 1.5840 3.6165 2.3284 1.9563 3.4537 2.4999 2.3043 3.5558 11.7967 4.4564 9.1294 4.2343 2.0389 5.0385 2.8896 6.5641 6.3468 5.9905 7.8110 2.0310 4.1184 2.8576 2.4912 6.5023 4.1379 1.6325 3.3296 1.5873 1.6944 3.7079 3.6572 1.5855 1.9148 2.3594 3.2517 2.6682 1.8631 2.1932 3.0935 2.7892 2.1361 2.0603 3.4655 3.0106 2.4943 2.0690 2.4827 2.2479 2.8108 2.8667 1.4954 1.8124 1.1529 1.4696 1.2804 1.3329 1.3096 1.2443 3.0045 1.4862 1.3234 1.2108 1.5445 1.4761 6.9151 1.2744 1.7610 1.6984 1.4770 1.2102 1.0821 1.0854 1.0842 1.0959 1.0951 1.0809 1.0952 1.0516 1.0412 6.9427 8.6812 5.4946 11.7468 1.0706 1.0704 1.0687 1.0665 1.0667 1.0587 1.0360 1.0845 1.0607 1.0893 1.1010 1.0896 1.1005 1.0967 1.0982 1.0975 1.1031 1.0757 1.0782
irintensity: 0.4199 0.1497 0.7301 0.1141 0.3513 0.2591 0.0384 0.7187 5.0045 13.2417 0.8937 3.1902 0.9005 0.5349 5.1220 2.2591 2.1338 8.6482 6.6163 7.5079 26.7479 0.5982 11.1129 0.7942 1.1840 13.1584 0.4422 10.5434 19.6068 2.7819 1.8683 3.4308 8.1024 2.2797 37.8442 11.5219 3.6468 1.5534 6.6395 9.0747 198.7516 11.2358 24.5811 0.7476 0.8845 18.6318 12.6577 6.8472 2.0936 11.1583 6.3160 32.8355 10.2179 25.3320 44.6354 14.5429 14.8667 5.1428 27.7710 0.9164 9.2622 3.9447 30.3327 43.0489 3.9913 26.3025 15.2893 13.7231 46.2875 7.0262 295.8762 9.6695 31.9729 13.1550 56.2547 26.0462 211.4839 4.7872 3.4964 5.0301 10.0857 16.4562 3.0644 2.4050 27.6907 13.8227 9.9152 7.2710 9.6122 8.0143 16.8113 345.6938 83.1590 638.6479 7.5503 59.6629 49.2150 156.0645 53.5476 79.7325 14.9706 24.0824 16.2923 9.8896 52.1212 5.0353 2.9498 5.2907 44.7602 30.9137 29.8529 21.7072 86.1946 45.7732
temp: 298.150 k
press: 1.00000 atm
elementType: 8 8 8 8 7 7 7 6 6 6 6 6 6 6 6 6 6 6 6 6 6 1 1 1 1 1 1 1 1 1 1 1 1 1 1 1 1 1 1 1
symmnumber: 1
zpe: 842588.9 jmol-1
zpe.correction: 0.320925 hartree
zpe.thermalcorrener: 0.341845 hartree
zpe.thermalcorrenthalpy: 0.342789 hartree
zpe.thermalcorrgfe: 0.267638 hartree
zpe.sumelectzpe: -1008.406962 hartree
zpe.sumelectthermal: -1008.386042 hartree
zpe.sumelectthermalent: -1008.385098 hartree
zpe.sumelectthermalfe: -1008.460249 hartree
dipole: 0.2155 -1.8997 -0.8929
dipole: 2.1101
quadrupole: -135.2975 -131.4950 -123.5334
quadrupole: 8.0589 10.3944 1.2871
quadrupole: -5.1889 -1.3864 6.5752 8.0589 10.3944 1.2871
hfenergy: -1008.7278869 hartree
pointgroup: C01 [X(C14H19N3O4)]
dipole: -0.0844551 -0.0822025 -0.8217624 debye
polarizability: 243.3715575|-0.8990805|142.7840385|-8.3428833|-12.4789395|168.9723602 unknown
InChI: InChI=1S/C14H19N3O4/c1-2-14(11(18)15-13(20)16-12(14)19)5-3-4-6-17-7-9-21-10-8-17/h15-16H,2,5-10H2,1H3
charge 0 multiplicity 1
40 atoms
O  5.343411 -0.133241 1.736888
O  -4.075793 0.811745 -1.600192
O  -0.191276 0.685078 1.284923
O  -4.158362 -1.404347 2.485338
N  3.515959 -0.752962 -0.431387
N  -4.066806 -0.297731 0.427325
N  -2.142342 -0.442053 1.790537
C  -1.896644 0.579546 -0.489192
C  -1.473592 1.991718 -0.983547
C  -1.304397 -0.538556 -1.469855
C  -3.421839 0.40925 -0.604303
C  -1.333541 0.313886 0.915877
C  3.221148 0.34531 0.53025
C  4.983134 -0.927662 -0.588823
C  3.884659 0.03768 1.879833
C  5.618246 -1.217192 0.78182
C  2.858599 -0.547742 -1.748847
C  -2.029018 3.149063 -0.12865
C  0.157359 -0.52909 -1.579611
C  -3.500035 -0.767855 1.627333
C  1.387434 -0.548158 -1.662488
H  -1.824348 2.095008 -2.026382
H  -0.370263 2.018266 -0.988766
H  -1.767084 -0.346975 -2.457489
H  -1.651524 -1.536969 -1.136268
H  2.128616 0.430317 0.666214
H  3.604985 1.325534 0.146958
H  5.463605 -0.014917 -1.026382
H  5.177218 -1.778611 -1.270329
H  3.753668 0.874149 2.58528
H  3.441693 -0.886603 2.308553
H  5.219621 -2.176642 1.177008
H  6.716897 -1.274673 0.705736
H  3.180613 -1.368192 -2.420839
H  3.188058 0.410333 -2.232192
H  -3.1343 3.163202 -0.128968
H  -1.673397 3.089709 0.915957
H  -1.68804 4.116392 -0.5379
H  -5.069443 -0.479459 0.310881
H  -1.728376 -0.709456 2.689999
