program: Gaussian 09
title: 000121415
version: EM64L-G09RevD.01
frameworkgroup: C1[X(C18H23NOS)]
method: RPBEPBE
basis: SDD
operation: Freq
keyword: #p
keyword: freq=noraman
keyword: PBEPBE/SDD
title: #p freq=noraman PBEPBE/SDD
converged: YES YES NO NO
title: Mulliken charges:
elementType: S O N C C C C C C C C C C C C C C C C C C H H H H H H H H H H H H H H H H H H H H H H H
charge: 0.246082 -0.467879 -0.071860 -0.353460 -0.364209 -0.394108 -0.402331 -0.393152 -0.398959 -0.488585 0.109308 0.318291 -0.106885 -0.402326 -0.378849 -0.305715 -0.135062 -0.245805 -0.225006 -0.516056 -0.241782 0.167342 0.224731 0.212062 0.166639 0.191922 0.237470 0.193201 0.204323 0.204012 0.192162 0.214223 0.189060 0.251386 0.219806 0.347171 0.258030 0.271264 0.290272 0.241060 0.227103 0.226147 0.259651 0.229310
chargesum: 0.00000
title: Mulliken charges with hydrogens summed into heavy atoms:
elementType: S O N C C C C C C C C C C C C C C C C C C
charge: 0.246082 -0.120708 -0.071860 0.038613 0.014492 0.035284 -0.004807 0.003023 0.004325 -0.017393 0.109308 0.318291 -0.106885 -0.144296 -0.107585 -0.015443 0.105998 -0.018701 0.001141 -0.256405 -0.012472
polarizability: 2.25670007e+02 -1.21608684e+01 2.24674673e+02 1.19854816e+01 -1.06551765e+01 1.83523201e+02
1716.lowfreq: -5.7175 0.0009 0.0013 0.0017 4.7392 10.0806 18.7398 25.7044 33.3781
frequency: 17.2143 25.6337 33.2205 44.9134 50.1848 57.7347 99.9828 123.8495 175.9112 187.2591 198.2524 232.1539 234.7131 249.8073 260.6323 281.5760 299.0507 325.4660 331.8778 377.3468 401.1428 405.6178 432.3302 441.7546 450.8619 485.8624 520.1577 546.4444 568.7773 603.3616 616.6391 620.9435 683.2038 693.0119 693.7050 708.7273 748.7899 761.3070 795.0605 802.4698 811.0715 835.1494 844.4110 853.5241 858.0773 860.0022 892.5854 910.0051 917.4934 934.7382 957.8178 983.6724 990.0348 992.5664 998.5305 1023.1519 1025.3429 1038.7367 1045.1219 1058.7538 1069.4804 1082.1028 1090.0209 1099.8940 1113.5213 1120.9105 1128.6561 1151.0397 1155.3901 1172.1949 1174.9181 1194.6985 1201.9811 1214.7607 1239.1775 1259.2808 1264.9479 1276.0016 1282.7372 1299.0115 1313.0879 1321.4345 1330.4606 1338.0297 1341.3372 1347.1534 1349.9982 1374.3957 1379.7486 1393.8421 1435.7262 1452.8922 1460.6903 1462.2901 1465.4634 1468.1124 1476.1586 1480.7584 1481.6485 1489.5621 1552.6464 1590.7026 1609.9107 2813.8883 2818.3717 2836.0821 2966.7065 2985.6530 2985.8995 3005.8193 3010.8966 3018.8827 3033.5238 3043.3185 3046.1624 3054.7856 3069.8493 3123.6415 3131.9396 3144.6507 3153.4603 3165.5876 3172.2160 3205.1608 3236.4347 3558.1595
redmass: 3.9794 6.4145 3.6052 4.2440 3.7072 5.3172 3.4643 3.8486 5.5266 4.5937 3.1839 1.9819 2.4839 1.3484 3.1896 4.6065 1.9945 3.6916 4.2450 1.9316 2.8381 2.8241 3.6643 3.9342 3.0752 4.3798 3.6594 2.4970 2.5104 6.2888 6.3875 4.1423 4.6001 1.3929 3.5573 1.7297 2.5946 2.2572 2.3376 1.8596 1.8815 3.5957 1.2953 1.6256 2.1240 1.3024 2.5385 2.1016 1.4830 1.4529 1.2980 1.4203 5.5494 2.5478 1.3170 2.2320 2.4109 2.3164 2.3656 1.9989 1.8011 1.5725 1.5876 1.7634 2.2230 2.4273 2.0789 1.3916 2.2253 1.1769 1.4574 1.1216 1.4253 1.7328 1.6875 1.3189 1.1772 1.4842 1.2657 1.3988 1.5049 1.3713 1.2789 1.9171 1.4461 1.5328 1.4997 1.3961 7.8575 1.4226 2.2284 1.0903 1.1007 1.0888 1.0991 1.1033 1.0931 4.3614 2.3878 1.0990 6.3800 6.0615 5.9882 1.0714 1.0714 1.0695 1.0628 1.0630 1.0600 1.0708 1.0757 1.0866 1.0955 1.0902 1.1007 1.1034 1.1014 1.0845 1.0877 1.0924 1.0955 1.1012 1.0905 1.0963 1.1005 1.0658
irintensity: 0.0606 0.9112 0.5082 0.0251 0.6956 0.1801 0.3175 0.1667 1.8669 4.9215 0.0535 0.1341 22.6129 129.5421 15.2076 3.4195 11.9212 14.7295 17.9988 1.7232 1.8172 1.7138 1.7824 2.5133 0.0426 3.1638 2.0145 5.7933 4.4206 5.8928 0.1280 12.6731 4.9287 80.7189 15.2614 60.1572 7.6964 75.9656 15.7864 9.1755 14.9806 4.9437 18.8644 7.1712 13.3656 0.4986 15.7412 12.1774 1.0813 1.9342 2.7268 0.1389 0.4146 15.5963 0.4093 6.2609 8.0759 15.8362 2.4404 17.4523 12.9871 6.8611 4.4386 10.4728 26.8608 5.9331 17.1284 8.1672 16.4979 3.7658 8.0709 1.7459 49.5383 8.2934 5.2969 6.6891 7.5430 25.7237 17.0609 26.4515 7.3104 0.6149 5.1042 12.4797 1.4259 22.1590 1.0799 9.1287 0.8988 2.7672 10.8532 6.4204 14.0747 15.7625 8.4110 9.9264 2.2954 11.5847 2.7460 4.9949 0.1037 0.9408 2.3316 41.2534 43.6581 201.3263 40.2365 25.1572 40.1467 3.9009 10.8129 75.5432 70.9060 37.1425 7.0637 98.3710 26.0140 0.6116 5.1542 21.2762 22.4488 21.7125 9.2736 0.2085 1.3213 6.3019
temp: 298.150 k
press: 1.00000 atm
elementType: 16 8 7 6 6 6 6 6 6 6 6 6 6 6 6 6 6 6 6 6 6 1 1 1 1 1 1 1 1 1 1 1 1 1 1 1 1 1 1 1 1 1 1 1
symmnumber: 1
zpe: 966018.0 jmol-1
zpe.correction: 0.367937 hartree
zpe.thermalcorrener: 0.388044 hartree
zpe.thermalcorrenthalpy: 0.388988 hartree
zpe.thermalcorrgfe: 0.316859 hartree
zpe.sumelectzpe: -1226.141955 hartree
zpe.sumelectthermal: -1226.121847 hartree
zpe.sumelectthermalent: -1226.120903 hartree
zpe.sumelectthermalfe: -1226.193033 hartree
dipole: -1.4551 0.8876 0.4481
dipole: 1.7624
quadrupole: -127.0409 -125.4131 -131.2007
quadrupole: -0.4357 -0.7992 0.8392
quadrupole: 0.8440 2.4718 -3.3158 -0.4357 -0.7992 0.8392
hfenergy: -1226.5098915 hartree
pointgroup: C01 [X(C18H23N1O1S1)]
dipole: -0.5572516 -0.3751683 -0.1716877 debye
polarizability: 225.2822488|11.9227201|224.5396281|-11.340909|-12.4893134|184.0460046 unknown
InChI: InChI=1S/C18H23NOS/c20-18(17-10-7-15-21-17,16-8-3-1-4-9-16)11-14-19-12-5-2-6-13-19/h1,3-4,7-10,15,20H,2,5-6,11-14H2
charge 0 multiplicity 1
44 atoms
S  2.428623 1.587183 1.523565
O  1.13865 0.24831 -2.136953
N  -2.800905 0.01582 -0.084583
C  -3.371964 1.38143 -0.230136
C  -3.790336 -1.023339 -0.476728
C  -1.523849 -0.151967 -0.822753
C  -4.641828 1.550295 0.629203
C  -5.06848 -0.930663 0.380371
C  -5.695726 0.477635 0.274292
C  -0.392721 0.730592 -0.247469
C  1.038372 0.26444 -0.648426
C  1.429106 -1.129218 -0.098822
C  2.05997 1.312263 -0.228019
C  0.781197 -1.734556 1.007064
C  2.516112 -1.808121 -0.709537
C  2.789131 2.174001 -1.029379
C  3.649679 3.06898 -0.289099
C  1.210472 -2.993088 1.488654
C  2.942854 -3.064409 -0.23089
C  3.577905 2.89641 1.082232
C  2.290207 -3.663594 0.872368
H  -3.622092 1.593441 -1.30509
H  -2.612638 2.119742 0.081921
H  -3.317032 -2.015483 -0.349175
H  -4.070003 -0.924385 -1.560582
H  -1.650614 0.07202 -1.915085
H  -1.239217 -1.218416 -0.737273
H  -5.051943 2.567598 0.478948
H  -4.363169 1.455512 1.696626
H  -4.805054 -1.139922 1.435272
H  -5.78725 -1.706429 0.052934
H  -6.576228 0.562609 0.938904
H  -6.055487 0.643174 -0.762713
H  -0.490444 1.770693 -0.605419
H  -0.488143 0.757373 0.854064
H  0.592509 -0.511158 -2.464972
H  -0.058319 -1.235079 1.502957
H  3.027138 -1.332235 -1.553265
H  2.701367 2.152497 -2.116435
H  4.296714 3.812495 -0.761427
H  0.699745 -3.447157 2.345337
H  3.786255 -3.57309 -0.711606
H  4.106499 3.421327 1.875991
H  2.621638 -4.638031 1.248434
