program: Gaussian 09
title: 000121354
version: EM64L-G09RevD.01
frameworkgroup: C1[X(C9H18N2O3S)]
method: RPBEPBE
basis: SDD
operation: Freq
keyword: #p
keyword: freq=noraman
keyword: PBEPBE/SDD
title: #p freq=noraman PBEPBE/SDD
converged: YES YES NO NO
title: Mulliken charges:
elementType: S O O O N N C C C C C C C C C H H H H H H H H H H H H H H H H H H
charge: 0.107676 -0.300888 -0.226583 -0.283784 -0.587486 -0.618200 0.375938 -0.358170 -0.785827 -0.385436 -0.729005 -0.407520 -0.702422 0.026927 0.297599 0.198904 0.199698 0.311030 0.274551 0.232692 0.247978 0.225151 0.221738 0.224350 0.243031 0.211750 0.204200 0.216922 0.209618 0.337374 0.341409 0.340199 0.336585
chargesum: 0.00000
title: Mulliken charges with hydrogens summed into heavy atoms:
elementType: S O O O N N C C C C C C C C C
charge: 0.107676 -0.300888 -0.226583 -0.283784 0.091297 0.058585 0.375938 0.040432 -0.200246 0.095234 -0.057767 0.047261 -0.071681 0.026927 0.297599
polarizability: 1.84087821e+02 6.43427712e+00 1.27459449e+02 -1.49330493e+00 -5.87501243e+00 1.07736521e+02
1716.lowfreq: -7.2190 -0.0025 -0.0014 -0.0007 7.2467 11.3917 26.0311 37.9401 42.2716
frequency: 25.9662 37.8717 42.1289 47.7981 58.7826 77.9003 92.5492 94.9095 157.5759 188.0758 202.4362 221.4587 229.9448 245.8762 251.1459 268.6975 325.0111 352.7528 378.7599 398.5364 443.9256 464.2275 471.2956 478.1475 492.6550 520.4389 521.2171 551.9223 602.9354 611.2860 639.9361 695.2536 698.9345 741.0398 767.3236 806.7738 848.7115 867.2200 892.1864 923.4922 959.6057 978.3798 1012.4266 1049.3131 1057.3607 1058.2646 1068.0397 1094.5282 1138.7575 1175.2301 1200.5040 1236.5157 1251.8495 1260.0409 1290.7476 1296.0762 1300.9786 1316.0650 1319.0935 1361.9602 1371.7186 1384.9193 1394.4339 1445.8959 1453.1301 1464.4910 1471.3968 1476.2012 1478.0555 1487.1202 1488.5939 1587.4678 1599.9497 1664.0817 1689.4231 2967.8750 2970.2193 2978.8609 2982.5411 3000.7892 3011.0497 3017.5479 3040.7815 3068.4365 3070.5758 3074.9138 3077.8527 3082.2785 3084.1832 3523.2288 3559.0320 3677.2981 3717.6684
redmass: 5.7371 5.0353 3.8206 5.9187 3.6791 4.4935 4.0314 2.5752 3.5328 5.2001 2.4707 4.2757 1.4321 1.1494 2.1864 3.5373 2.3641 2.2438 2.9594 3.4001 10.9155 1.5641 2.0347 2.2556 1.1788 1.1585 1.1274 2.7372 3.7271 5.6074 4.4752 6.3192 11.0590 1.1998 3.0033 4.3159 1.3916 1.8673 1.7978 1.8780 1.7516 1.5209 6.9146 2.6939 1.9541 2.0467 1.4386 2.3391 1.7456 2.0447 2.2438 1.3551 1.6038 1.9860 1.2968 1.4421 2.1944 1.2077 1.4771 1.5131 1.4003 1.2159 1.2203 1.0839 1.0767 1.0815 1.0612 1.0426 1.0439 1.0664 1.0801 1.2063 1.2276 6.1789 7.2681 1.0435 1.0511 1.0364 1.0596 1.0584 1.0578 1.0981 1.1016 1.1020 1.0992 1.1005 1.1054 1.1009 1.1039 1.0445 1.0445 1.1051 1.1057
irintensity: 0.1562 1.7514 3.6589 3.0969 9.7160 5.5815 0.8653 3.6249 4.2208 4.1768 0.5766 10.1984 3.0305 0.1725 4.6042 2.8721 4.2522 6.9760 2.3324 2.1320 3.7814 3.8267 5.1376 3.2627 283.7497 161.6827 159.8271 2.9905 73.0631 10.5896 37.9910 4.6918 31.3693 27.1947 2.6801 46.5090 4.4949 3.1815 13.2478 17.9505 8.2548 5.7325 220.5931 1.5314 16.5218 10.9081 3.9958 2.7014 2.9415 2.8003 3.2652 5.2881 185.6827 198.1509 20.5339 23.4712 309.5688 28.8627 12.7423 3.3660 61.7968 9.8530 35.2980 3.3379 5.8299 16.8091 21.1544 6.4979 1.4836 11.7487 31.1548 126.3752 89.6118 281.8453 322.9085 15.9045 36.5052 17.8428 39.0383 16.3546 27.7410 11.9856 4.0481 66.1553 44.6050 30.2944 10.8984 25.2181 28.9526 67.9563 63.9916 37.9332 50.7355
temp: 298.150 k
press: 1.00000 atm
elementType: 16 8 8 8 7 7 6 6 6 6 6 6 6 6 6 1 1 1 1 1 1 1 1 1 1 1 1 1 1 1 1 1 1
symmnumber: 1
zpe: 714917.3 jmol-1
zpe.correction: 0.272298 hartree
zpe.thermalcorrener: 0.290813 hartree
zpe.thermalcorrenthalpy: 0.291757 hartree
zpe.thermalcorrgfe: 0.223959 hartree
zpe.sumelectzpe: -1085.823414 hartree
zpe.sumelectthermal: -1085.804899 hartree
zpe.sumelectthermalent: -1085.803954 hartree
zpe.sumelectthermalfe: -1085.871752 hartree
dipole: 1.2663 1.6987 2.4743
dipole: 3.2575
quadrupole: -68.0670 -104.3644 -101.4708
quadrupole: -13.8504 1.7237 0.3262
quadrupole: 23.2337 -13.0637 -10.1701 -13.8504 1.7237 0.3262
hfenergy: -1086.0957112 hartree
pointgroup: C01 [X(C9H18N2O3S1)]
dipole: 0.3575149 1.0641229 0.6183174 debye
polarizability: 179.8004316|15.2135044|124.1175133|-6.0091447|-12.6478147|115.3658461 unknown
InChI: InChI=1S/C9H18N2O3S/c1-3-4-9(2,5-14-7(10)12)6-15-8(11)13/h3-6,10-11H2,1-2H3
charge 0 multiplicity 1
33 atoms
S  2.581315 -0.653098 1.034339
O  -2.651801 -0.151918 -0.181976
O  3.28078 0.372871 -1.457708
O  -3.507442 -2.258499 0.482883
N  4.856706 0.58016 0.248227
N  -4.778895 -0.288801 0.594167
C  -0.23945 -0.291066 0.471283
C  -0.107456 1.262258 0.467484
C  1.051189 -1.002953 -0.024405
C  -1.343864 -0.767065 -0.515048
C  -0.591335 -0.767073 1.904748
C  0.131922 1.94959 -0.897672
C  0.318765 3.474971 -0.735555
C  3.639807 0.19311 -0.267291
C  -3.643662 -1.020803 0.320528
H  0.720641 1.529911 1.155164
H  -1.03474 1.674129 0.912909
H  1.346008 -0.69201 -1.044129
H  0.925116 -2.099074 -0.001186
H  -1.12792 -0.445817 -1.547803
H  -1.458624 -1.866487 -0.479082
H  -1.536607 -0.308276 2.245058
H  -0.710326 -1.865378 1.949311
H  0.203343 -0.470419 2.613683
H  1.027845 1.528498 -1.392179
H  -0.729431 1.763488 -1.568821
H  -0.567446 3.937493 -0.260238
H  0.476273 3.967734 -1.712533
H  1.195831 3.698913 -0.09904
H  5.106703 0.411169 1.22116
H  5.524443 1.034916 -0.373398
H  -5.596164 -0.773144 0.953419
H  -4.800526 0.71267 0.418698
