program: Gaussian 09
title: 000121271
version: EM64L-G09RevD.01
frameworkgroup: C1[X(C12H19N3O)]
method: RPBEPBE
basis: SDD
operation: Freq
keyword: #p
keyword: freq=noraman
keyword: PBEPBE/SDD
title: #p freq=noraman PBEPBE/SDD
converged: YES YES NO NO
title: Mulliken charges:
elementType: O N N N C C C C C C C C C C C C H H H H H H H H H H H H H H H H H H H
charge: -0.367759 -0.144909 -0.393426 -0.687973 -0.436210 -0.364434 -0.372989 -0.618144 -0.607317 0.202176 0.137214 0.312070 -0.308340 -0.399691 -0.308166 -0.205105 0.212436 0.232208 0.201836 0.234574 0.209119 0.262320 0.366401 0.196772 0.226217 0.237257 0.198659 0.233041 0.222746 0.199048 0.214269 0.223641 0.221404 0.380617 0.290441
chargesum: 0.00000
title: Mulliken charges with hydrogens summed into heavy atoms:
elementType: O N N N C C C C C C C C C C C C
charge: -0.367759 -0.144909 -0.027025 -0.016914 0.008433 0.071976 0.098449 0.042101 0.047130 0.202176 0.137214 0.312070 -0.109292 -0.185422 -0.084525 0.016300
polarizability: 2.06303738e+02 -5.74384861e+00 1.76701867e+02 -1.50674826e+01 -6.85173468e+00 9.73047616e+01
1716.lowfreq: -10.7947 -0.0009 -0.0004 0.0004 3.7491 9.4180 19.4319 27.7583 49.0247
frequency: 18.3519 27.2855 48.7074 63.6493 100.5743 120.6720 142.3690 180.9399 207.6677 236.5554 245.0593 250.8400 290.0056 327.4410 346.9717 356.6661 390.5814 403.9924 414.7207 427.8831 447.0884 485.0482 524.4788 552.6705 607.0327 653.3065 677.5310 723.0655 735.6153 753.8069 765.3752 790.0571 802.5696 818.6773 844.3785 847.1187 889.0579 927.8476 945.2832 967.8824 994.3213 1025.0072 1031.7656 1047.9638 1064.9160 1067.5170 1084.5625 1097.8883 1137.9111 1152.7205 1163.3465 1167.8049 1180.0165 1215.2831 1247.3246 1261.9410 1273.5006 1286.2716 1296.5011 1333.8327 1341.8012 1353.3509 1372.9877 1401.5425 1418.0918 1430.4811 1441.7875 1457.4607 1464.3157 1465.0584 1471.7790 1478.9185 1480.3021 1481.7628 1488.3417 1500.6542 1525.2061 1576.5103 1600.9653 1631.9248 2867.4290 2874.3675 2888.0424 2982.5744 2994.2407 3021.3212 3024.7342 3035.5754 3051.5568 3081.2238 3083.1337 3092.5571 3115.1248 3121.3436 3139.2073 3163.5980 3301.8601 3432.0312 3637.7092
redmass: 3.9314 4.2085 3.0369 5.0409 3.2103 3.5750 5.2501 2.0544 2.3388 1.6779 1.4373 1.5146 3.3685 2.8620 4.3383 2.0413 2.7584 6.4193 2.1071 1.9898 1.6390 3.3029 3.1533 6.7034 3.0211 6.0405 4.2241 1.5995 1.4367 2.5221 1.7835 1.8859 2.7580 1.2933 1.5578 3.4964 2.8855 1.3865 2.0686 1.3179 2.1887 2.4902 1.5715 2.3252 1.8278 1.8287 1.4669 1.8664 1.5822 1.6744 1.7700 1.5349 1.2963 1.3870 1.5837 2.1608 1.3358 1.7064 1.9671 1.7910 1.3724 1.3500 1.3462 5.5524 1.1468 2.4290 1.1928 1.0813 1.1536 1.0577 1.2653 1.2231 1.1737 1.2230 1.0830 1.9626 3.1177 6.1610 1.6275 6.7586 1.0694 1.0551 1.0555 1.0672 1.0620 1.0891 1.0763 1.0751 1.0992 1.1012 1.0965 1.1003 1.0856 1.0878 1.0939 1.1000 1.0612 1.0781 1.0901
irintensity: 0.6799 1.0959 0.6710 3.2234 0.3631 0.9239 0.0987 2.1234 1.7753 1.9408 0.9429 0.1575 2.3773 9.6958 9.5196 19.7921 0.3645 1.0079 33.6716 38.8545 77.9211 18.0619 17.0467 0.2719 9.6756 9.4559 30.7099 40.0076 15.2456 1.6572 146.6959 44.0095 1.7535 103.2802 4.1885 5.1878 21.4887 7.6841 15.7191 0.1206 48.7420 12.8862 13.6269 2.5817 15.9963 4.2571 6.9087 4.6080 4.0904 15.6376 8.0292 38.3155 6.3644 14.3872 1.4733 25.9759 12.9946 115.2662 132.1242 3.6536 1.2655 18.8747 0.9359 24.7397 8.6480 14.5184 5.7127 16.6321 40.2138 15.9698 25.2161 36.1695 5.5056 31.4745 18.8413 279.7814 429.4321 95.8455 65.5242 183.6362 49.0235 63.4412 258.4313 42.4148 65.4292 8.5938 34.4559 35.5980 58.6604 25.1813 17.5998 30.6117 14.1587 5.6552 39.7345 25.0843 195.5699 226.0238 49.9494
temp: 298.150 k
press: 1.00000 atm
elementType: 8 7 7 7 6 6 6 6 6 6 6 6 6 6 6 6 1 1 1 1 1 1 1 1 1 1 1 1 1 1 1 1 1 1 1
symmnumber: 1
zpe: 782238.7 jmol-1
zpe.correction: 0.297939 hartree
zpe.thermalcorrener: 0.314448 hartree
zpe.thermalcorrenthalpy: 0.315392 hartree
zpe.thermalcorrgfe: 0.252447 hartree
zpe.sumelectzpe: -706.938662 hartree
zpe.sumelectthermal: -706.922153 hartree
zpe.sumelectthermalent: -706.921209 hartree
zpe.sumelectthermalfe: -706.984154 hartree
dipole: 2.6997 2.1113 0.8151
dipole: 3.5229
quadrupole: -76.2892 -96.5722 -99.7597
quadrupole: 1.7261 -4.0997 -2.1046
quadrupole: 14.5845 -5.6985 -8.8860 1.7261 -4.0997 -2.1046
hfenergy: -707.2366011 hartree
pointgroup: C01 [X(C12H19N3O1)]
dipole: 1.0604696 0.7211482 -0.5256935 debye
polarizability: 200.6649001|-25.1329816|129.8440462|-15.6065653|-35.7080221|149.8014207 unknown
InChI: InChI=1S/C12H19N3O/c1-15(2)9-5-8-14-12(16)10-6-3-4-7-11(10)13/h3-4,6-7,14H,5,8-9,13H2,1-2H3
charge 0 multiplicity 1
35 atoms
O  -0.584478 -1.597275 1.909243
N  3.17456 0.517072 -0.859797
N  0.894633 -0.884554 0.277207
N  -2.962579 -0.510274 2.085992
C  3.182827 -0.81245 1.321411
C  3.320282 0.563956 0.624968
C  2.01624 -1.688047 0.772835
C  4.236693 -0.280037 -1.516754
C  3.100121 1.883436 -1.432168
C  -0.351174 -0.870718 0.86469
C  -1.39781 0.010931 0.257622
C  -2.676302 0.164552 0.916955
C  -1.179555 0.711464 -0.962639
C  -3.650516 1.038679 0.333688
C  -2.148374 1.558316 -1.528391
C  -3.391767 1.721966 -0.861787
H  4.124421 -1.389226 1.241943
H  3.024706 -0.612602 2.398117
H  4.295153 1.026719 0.92201
H  2.520982 1.230238 1.000451
H  2.385747 -2.31902 -0.059266
H  1.628297 -2.356286 1.559225
H  1.164387 -0.255343 -0.489406
H  5.257182 0.148146 -1.356887
H  4.047038 -0.322424 -2.603902
H  4.234049 -1.313137 -1.13121
H  4.032448 2.476356 -1.263505
H  2.257197 2.433741 -0.977217
H  2.926314 1.821697 -2.521205
H  -0.235195 0.582451 -1.505025
H  -4.616229 1.16007 0.840198
H  -1.949729 2.076683 -2.471649
H  -4.159368 2.379685 -1.286059
H  -2.231914 -1.153658 2.433067
H  -3.86319 -0.391909 2.542246
