program: Gaussian 09
title: 000121287
version: EM64L-G09RevD.01
frameworkgroup: C1[X(C16H23NO2)]
method: RPBEPBE
basis: SDD
operation: Freq
keyword: #p
keyword: freq=noraman
keyword: PBEPBE/SDD
title: #p freq=noraman PBEPBE/SDD
converged: YES YES NO NO
title: Mulliken charges:
elementType: O O N C C C C C C C C C C C C C C C C H H H H H H H H H H H H H H H H H H H H H H H
charge: -0.307443 -0.192493 -0.057196 -0.399132 -0.398348 -0.388277 -0.366991 -0.365057 -0.452467 0.199520 0.092545 0.369949 0.361005 0.489438 -0.591584 -0.598678 -0.822282 -0.810776 -0.816789 0.214848 0.187553 0.192545 0.213634 0.208462 0.191210 0.163747 0.250859 0.211026 0.168694 0.250666 0.217563 0.237558 0.238257 0.230617 0.224306 0.267525 0.241688 0.237705 0.222651 0.234136 0.224346 0.225464
chargesum: 0.00000
title: Mulliken charges with hydrogens summed into heavy atoms:
elementType: O O N C C C C C C C C C C C C C C C C
charge: -0.307443 -0.192493 -0.057196 0.003268 0.007830 0.011395 0.047616 0.014663 0.015761 0.199520 0.092545 0.369949 0.361005 0.489438 -0.354026 -0.360421 -0.099835 -0.108732 -0.132844
polarizability: 2.46492684e+02 2.45024203e+00 1.74186759e+02 1.22814770e+01 -3.06343966e+00 1.37104850e+02
1716.lowfreq: -9.9189 -0.0005 0.0002 0.0007 2.1053 6.8401 13.7532 33.8627 38.4422
frequency: 12.9356 33.3770 38.1493 39.7264 48.5351 75.6106 98.0009 99.7775 127.5077 146.4482 177.5250 179.9664 208.1029 226.0411 239.3550 264.4431 284.3624 287.5856 305.1398 317.7053 359.6991 379.7578 423.5848 447.7635 488.6331 492.3611 513.1033 527.9660 550.6803 564.8767 575.5103 577.1526 673.4940 713.4523 751.0374 782.8942 805.3696 850.9342 855.7067 864.7077 876.1426 890.9033 914.1412 937.6696 952.7952 958.7644 978.8574 1000.8503 1014.7569 1018.7860 1042.5739 1045.0649 1047.8590 1050.9033 1051.7403 1066.5795 1084.2280 1115.4177 1120.5074 1127.9627 1153.8476 1168.3969 1192.8207 1199.1771 1252.7850 1256.6103 1264.4554 1274.9165 1297.1483 1329.9149 1330.7163 1338.7930 1342.3831 1351.2891 1369.8588 1373.3188 1387.7492 1396.6310 1397.8932 1399.2071 1416.3493 1435.1662 1439.9629 1451.8883 1460.6575 1463.2024 1464.5181 1465.7449 1468.2370 1474.5006 1476.3843 1477.9758 1484.7497 1495.4747 1611.1342 1614.4345 1676.4189 2813.6533 2818.7643 2835.2311 2965.6748 2974.0295 2979.3808 2981.1341 2986.4437 2990.9518 3016.2325 3029.1817 3033.9665 3048.7584 3055.2991 3057.1882 3058.1548 3061.6499 3065.7621 3083.9670 3090.8880 3091.3059 3117.4400 3121.5526
redmass: 3.3575 4.1168 1.2368 2.6250 4.4494 3.8084 2.7619 1.1271 1.2274 2.3901 4.5222 2.7623 3.4991 2.8683 1.9283 2.5926 2.6771 2.0820 4.2447 4.0419 5.1063 1.7504 3.9648 2.9212 3.3101 3.0741 3.0976 3.5578 3.2840 3.5020 2.6610 3.8807 4.4549 4.3405 4.4640 4.0603 1.5149 3.2735 1.4583 1.4175 3.1788 1.3138 2.4918 2.2405 3.4572 1.2959 2.0979 2.5696 1.6863 1.5346 1.8900 1.5530 1.5313 2.0695 1.5976 3.3695 1.5364 3.7592 2.5772 2.4172 1.2999 2.2772 1.4697 1.4013 1.4161 1.3619 1.2479 1.3363 1.3886 5.3368 1.3496 1.5037 1.4719 1.5045 1.4580 6.4419 1.4293 1.2552 1.2452 1.2530 2.6713 1.1411 1.9340 1.0906 1.0872 1.0501 1.0511 1.0804 1.0974 1.0548 1.0896 1.0978 1.2066 1.3697 7.2362 6.3649 10.5225 1.0713 1.0711 1.0695 1.0629 1.0387 1.0376 1.0368 1.0622 1.0611 1.0872 1.0843 1.0958 1.1033 1.0949 1.1023 1.0962 1.0976 1.0890 1.0997 1.0995 1.0995 1.0913 1.0920
irintensity: 0.0427 0.8393 0.2514 0.8360 0.0436 0.2708 1.0407 0.8065 2.8651 4.0254 1.7451 3.1629 1.8362 0.0755 2.5088 1.4279 2.8825 3.5241 1.9902 1.4374 1.5883 3.2984 3.3795 0.3482 0.3121 1.6019 0.0964 3.5183 4.1489 0.4786 1.8973 1.4184 4.9346 2.9028 9.2350 3.7235 0.1558 17.9573 7.5430 20.8319 14.3949 0.0455 12.4141 1.5893 1.0515 3.9791 7.4874 94.0323 13.8159 2.5486 3.5642 11.5470 8.8736 11.4189 19.6998 468.1832 150.1846 59.2184 56.6005 1.3639 9.7388 29.4466 31.7564 3.8786 3.7355 0.6461 2.0201 19.3597 8.2184 3.4522 1.9185 0.3759 0.7444 1.5620 2.6691 3.5070 11.5910 13.6834 15.2142 1.6254 1.6101 15.7971 10.1346 5.6574 15.2861 23.4224 15.2468 0.5795 13.8235 11.3985 1.4186 7.4736 27.5184 65.8878 7.7895 8.3381 134.0706 46.4869 82.7022 174.7800 41.1458 43.6155 30.1859 16.9228 30.3573 35.4667 55.8310 21.7210 58.5003 24.9269 21.2624 78.7165 17.9261 11.7328 18.3475 16.7559 17.5430 25.7204 25.9187 13.9103
temp: 298.150 k
press: 1.00000 atm
elementType: 8 8 7 6 6 6 6 6 6 6 6 6 6 6 6 6 6 6 6 1 1 1 1 1 1 1 1 1 1 1 1 1 1 1 1 1 1 1 1 1 1 1
symmnumber: 1
zpe: 935699.9 jmol-1
zpe.correction: 0.356389 hartree
zpe.thermalcorrener: 0.376616 hartree
zpe.thermalcorrenthalpy: 0.377560 hartree
zpe.thermalcorrgfe: 0.305073 hartree
zpe.sumelectzpe: -827.250959 hartree
zpe.sumelectthermal: -827.230733 hartree
zpe.sumelectthermalent: -827.229789 hartree
zpe.sumelectthermalfe: -827.302276 hartree
dipole: -0.1254 0.8613 -1.6186
dipole: 1.8378
quadrupole: -98.5110 -107.6460 -118.5327
quadrupole: -1.6917 4.6756 1.1186
quadrupole: 9.7189 0.5839 -10.3028 -1.6917 4.6756 1.1186
hfenergy: -827.6073486 hartree
pointgroup: C01 [X(C16H23N1O2)]
dipole: -0.0616302 0.0159833 -0.7202266 debye
polarizability: 246.2621571|9.9096995|164.826224|8.7598775|-16.5462415|146.695911 unknown
InChI: InChI=1S/C16H23NO2/c1-12-9-13(2)16(14(3)10-12)19-15(18)11-17-7-5-4-6-8-17/h9-10H,4-8,11H2,1-3H3
charge 0 multiplicity 1
42 atoms
O  0.571817 -0.233321 -0.961258
O  -0.427561 0.273259 1.100754
N  -3.037569 -0.261401 -0.112587
C  -5.813779 0.397739 0.608502
C  -4.605529 1.071136 1.297522
C  -5.411699 -0.998511 0.08091
C  -3.382582 1.106092 0.360071
C  -4.170795 -0.902705 -0.828695
C  -1.804912 -0.30099 -0.906282
C  -0.534433 -0.047915 -0.094914
C  1.910512 -0.030368 -0.465828
C  2.506856 -1.009246 0.362804
C  2.595461 1.119515 -0.922891
C  4.590594 0.330061 0.310023
C  3.855926 -0.802063 0.74005
C  3.942442 1.279036 -0.51887
C  1.732646 -2.224285 0.832342
C  1.900978 2.142077 -1.800973
C  6.047077 0.508048 0.704683
H  -6.66522 0.315294 1.310223
H  -6.153117 1.028057 -0.239981
H  -4.856855 2.103927 1.606614
H  -4.333246 0.505398 2.2088
H  -5.174411 -1.662318 0.934431
H  -6.244802 -1.459674 -0.48395
H  -3.602336 1.779819 -0.512399
H  -2.511214 1.515586 0.897559
H  -3.855597 -1.915038 -1.146234
H  -4.442526 -0.330182 -1.75655
H  -1.696482 -1.300128 -1.368532
H  -1.79368 0.429307 -1.75888
H  4.340829 -1.545735 1.384805
H  4.493641 2.164716 -0.858873
H  1.192444 -2.705977 -0.003278
H  2.406598 -2.970732 1.285011
H  0.978127 -1.939733 1.589198
H  1.458441 1.668916 -2.696035
H  1.074206 2.640049 -1.259456
H  2.60804 2.921706 -2.130798
H  6.721079 0.012303 -0.021089
H  6.32965 1.574954 0.738617
H  6.254182 0.068928 1.696538
