program: Gaussian 09
title: 000121233
version: EM64L-G09RevD.01
frameworkgroup: C1[X(C5H13NS2)]
method: RPBEPBE
basis: SDD
operation: Freq
keyword: #p
keyword: freq=noraman
keyword: PBEPBE/SDD
title: #p freq=noraman PBEPBE/SDD
converged: YES YES NO NO
title: Mulliken charges:
elementType: S S N C C C C C H H H H H H H H H H H H H
charge: -0.028997 -0.030040 -0.098374 0.061651 -0.764162 -0.740950 -0.635137 -0.614315 0.199105 0.280261 0.291188 0.272182 0.305598 0.266746 0.187194 0.221397 0.226031 0.188437 0.223991 0.094786 0.093408
chargesum: 0.00000
title: Mulliken charges with hydrogens summed into heavy atoms:
elementType: S S N C C C C C
charge: 0.065789 0.063368 -0.098374 0.260756 -0.192712 -0.163170 0.040200 0.024143
polarizability: 1.02720950e+02 3.88250329e+00 1.00925848e+02 6.79816354e+00 -5.01239107e+00 7.71478926e+01
1716.lowfreq: -11.9735 -8.9843 -0.0012 0.0009 0.0015 3.9261 26.5863 60.0169 121.6017
frequency: 25.0524 59.9795 121.5945 175.9294 184.2267 202.8991 218.2336 232.9360 251.5652 297.5351 309.7369 381.0948 426.0175 468.6945 539.6791 636.9705 684.9127 764.5709 789.7955 846.3699 873.8443 941.7216 993.1608 1033.4883 1044.0282 1077.9758 1100.1207 1131.3401 1157.4027 1177.1998 1225.1020 1251.1423 1273.7834 1292.7589 1322.2217 1332.7058 1419.2566 1433.3203 1444.8003 1452.6337 1466.8188 1476.9589 1481.0230 1493.6615 2424.5289 2435.4139 2788.6542 2852.7588 2866.8269 3036.6044 3039.6877 3040.8224 3057.4904 3091.0918 3096.4946 3110.6619 3136.2205
redmass: 2.6541 5.3976 3.6806 1.6391 2.7161 1.3642 1.3696 1.2258 1.3337 2.8835 2.9241 2.4775 2.3496 2.1371 3.2730 3.6984 3.6006 1.4763 2.3960 1.2828 2.1204 1.6911 1.7725 1.5503 1.7930 1.4336 1.6791 1.5157 1.0817 1.8393 1.7492 1.3968 1.5840 1.3781 1.3311 1.5110 1.1333 1.0810 1.1341 1.1164 1.0520 1.0456 1.0518 1.0501 1.0383 1.0383 1.0795 1.0572 1.0570 1.0737 1.0583 1.0716 1.0589 1.1006 1.0999 1.1072 1.1054
irintensity: 1.0540 1.1858 0.3496 1.0555 3.0703 4.9818 13.7722 30.1881 0.0880 2.3296 7.7441 1.4440 1.7388 0.8951 5.1951 2.2110 19.0943 8.0820 11.2154 21.2975 10.7131 7.8337 8.5742 18.7199 36.5302 3.0008 9.5366 11.8464 5.4403 3.9078 5.1555 12.9139 4.2011 9.7136 16.4706 11.8344 0.2718 15.1056 20.7398 9.3636 4.1385 34.3259 7.1364 30.0860 43.4038 29.0549 67.8177 67.0678 196.8980 27.4785 32.2152 32.2141 20.5992 17.0560 34.8826 6.7750 7.6122
temp: 298.150 k
press: 1.00000 atm
elementType: 16 16 7 6 6 6 6 6 1 1 1 1 1 1 1 1 1 1 1 1 1
symmnumber: 1
zpe: 451539.6 jmol-1
zpe.correction: 0.171982 hartree
zpe.thermalcorrener: 0.183305 hartree
zpe.thermalcorrenthalpy: 0.184250 hartree
zpe.thermalcorrgfe: 0.134077 hartree
zpe.sumelectzpe: -1048.476688 hartree
zpe.sumelectthermal: -1048.465365 hartree
zpe.sumelectthermalent: -1048.464421 hartree
zpe.sumelectthermalfe: -1048.514594 hartree
dipole: -0.9956 -1.7709 2.2033
dipole: 2.9970
quadrupole: -71.1003 -60.7675 -66.6018
quadrupole: 1.9578 0.2320 1.8389
quadrupole: -4.9437 5.3890 -0.4452 1.9578 0.2320 1.8389
hfenergy: -1048.6486708 hartree
pointgroup: C01 [X(C5H13N1S2)]
dipole: 0.5842422 0.4702417 0.9098331 debye
dipolederiv: -0.0478098 0.1858096 -0.1485646 0.1632392 -0.1451535 -0.1312971 -0.1970197 -0.176491 -0.0934705 -0.2328292 0.1663486 0.0339364 0.2070862 -0.102071 0.1225964 0.1180635 0.1725692 -0.1057163 -0.7452538 -0.0375499 -0.0404857 0.0438114 -0.5947771 -0.0131779 -0.013792 0.0209338 -0.4873423 0.5358304 0.0715541 -0.0936944 -0.0535255 0.1232828 0.1127738 0.0058048 -0.0321681 0.2443044 -0.0747686 0.0324591 0.0852928 -0.0313358 0.2313842 0.2843759 0.127247 0.2426238 0.1923236 0.3006377 -0.0934138 -0.0883038 -0.0997941 0.0231102 0.0434729 -0.2361005 0.0204149 0.0843678 0.2461004 -0.099068 0.1335569 -0.2256977 0.1512444 -0.0172006 0.1525442 0.0242027 0.365709 0.100719 0.1053488 0.0253193 0.2005535 0.443356 0.0739555 0.0200943 0.0529467 0.3110146 -0.0473727 -0.0345377 -0.0155487 0.0386774 -0.1062233 -0.1645523 0.0970941 -0.0654668 -0.1813662 0.0379254 0.0779888 -0.1037144 0.0578798 -0.0351641 -0.0279232 -0.1034112 -0.0195728 -0.1021495 -0.0090858 -0.09076 0.0616227 -0.0344323 0.0838763 -0.0806726 0.0455451 -0.0874474 0.0026645 -0.0041597 -0.042874 0.0796089 -0.0249418 -0.0959001 0.0699237 0.0509392 0.0505596 0.0417483 0.0316724 0.0151461 0.027061 -0.0462081 0.1316343 -0.0859369 -0.0167538 -0.0451956 0.0182352 0.1487645 -0.0422577 -0.0045634 0.012678 -0.1098623 0.0178813 -0.0226744 0.0215219 0.0652569 -0.0249657 0.0630863 -0.0270203 0.0155742 0.0223499 -0.0892655 -0.1907289 0.0125808 -0.2589319 -0.1501919 -0.0022361 0.0706066 -0.0725846 0.0997956 0.0284828 0.1129711 0.0302911 0.020295 -0.1458062 -0.0708944 0.1126579 0.020898 0.0764998 -0.0236849 0.0892998 -0.0067178 0.0541024 0.0477903 -0.0424063 0.0113394 -0.0929366 -0.1208555 -0.0441168 -0.0870309 -0.2300585 -0.1851966 0.0416178 0.1385103 -0.1214369 0.0810435 -0.0368836 0.0603311 -0.1038951 0.0630156 0.0142093 -0.001705 -0.1712327 0.0736076 -0.1019769 -0.0444438 -0.0042586 0.1358228 0.0926023 0.005599 -0.0071096 -0.1290211 -0.0712772 -0.0580077 0.004801 -0.1317071 0.0159805 -0.1411444 -0.0056569 unknown
polarizability: 104.193108|3.7980424|97.3313651|-5.6936712|8.8088512|79.2702171 unknown
InChI: InChI=1S/C5H13NS2/c1-6(2)5(3-7)4-8/h5,7-8H,3-4H2,1-2H3
charge 0 multiplicity 1
21 atoms
S  -0.375783 -2.363501 -0.763605
S  -2.872206 0.965822 0.342829
N  1.251985 0.312591 -0.190912
C  -0.091993 0.201196 0.445454
C  -0.467415 -1.252938 0.787635
C  -1.167358 0.830019 -0.478011
C  2.299214 -0.529929 0.434727
C  1.723929 1.712367 -0.307695
H  -0.105135 0.753813 1.427198
H  0.195988 -1.673055 1.558986
H  -1.50796 -1.261347 1.15012
H  -0.888951 1.837374 -0.816155
H  -1.327166 0.185818 -1.357127
H  2.043546 -1.598125 0.34675
H  2.480295 -0.28455 1.511927
H  3.246421 -0.374151 -0.110914
H  2.708768 1.719378 -0.805847
H  1.835859 2.217997 0.685513
H  1.042298 2.31788 -0.926363
H  -1.260204 -3.316383 -0.280098
H  -2.523031 1.947821 1.257887
