program: Gaussian 09
title: 000121256
version: EM64L-G09RevD.01
frameworkgroup: C1[X(C9H18N6)]
method: RPBEPBE
basis: SDD
operation: Freq
keyword: #pfreq=noraman
keyword: PBEPBE/SDD
title: #p freq=noraman PBEPBE/SDD
converged: YES YES NO NO
title: Mulliken charges:
elementType: N N N N N N C C C C C C C C C H H H H H H H H H H H H H H H H H H
charge: -0.120224 -0.153969 -0.153948 -0.150502 -0.593974 -0.593978 -0.349706 -0.349599 -0.355304 -0.355367 0.155316 -0.685413 -0.685414 0.037992 0.038027 0.195569 0.243310 0.243192 0.195575 0.234989 0.193072 0.235084 0.193070 0.205427 0.214036 0.219684 0.205421 0.214028 0.219680 0.327791 0.324172 0.327791 0.324171
chargesum: 0.00000
title: Mulliken charges with hydrogens summed into heavy atoms:
elementType: N N N N N N C C C C C C C C C
charge: -0.120224 -0.153969 -0.153948 -0.150502 0.057989 0.057985 0.089173 0.089167 0.072757 0.072787 0.155316 -0.046266 -0.046284 0.037992 0.038027
polarizability: 1.86589491e+02 8.15075039e-03 1.65050166e+02 9.90152557e-03 -1.33231182e+01 9.26799172e+01
1716.lowfreq: -7.3179 -0.0006 -0.0001 0.0003 3.3345 4.1627 34.4227 34.7377 45.6552
frequency: 34.3500 34.6381 45.6030 66.6950 86.4991 88.9052 161.8595 192.9817 194.0583 200.7682 216.2420 225.0247 244.5786 277.4207 284.4760 314.9124 368.1639 372.4754 434.2573 447.0598 487.4988 535.8323 536.1418 553.6946 563.3791 616.6947 636.4090 705.9705 706.1397 740.9824 743.6738 790.6246 847.5050 864.6630 880.6120 884.0360 895.7296 902.2942 979.8202 1007.9816 1050.4669 1051.0803 1097.7408 1105.4241 1110.6125 1115.1606 1121.2769 1204.4532 1211.5698 1258.1691 1267.4306 1277.5191 1298.2798 1298.6390 1310.6645 1314.6770 1356.9422 1365.6034 1389.3559 1389.8744 1412.6405 1441.3758 1448.9372 1465.6141 1472.6902 1473.5318 1478.2370 1478.2998 1484.9494 1485.4493 1502.4644 1518.7394 1546.4217 1591.3914 1628.1522 2972.8368 2973.0664 2982.1113 2984.3305 2989.7139 2993.2983 3038.9951 3039.1544 3064.6880 3065.2443 3075.4922 3075.6128 3079.0806 3081.3307 3560.2621 3561.7995 3722.7751 3723.0118
redmass: 3.1731 3.1792 4.3323 3.5375 1.8462 1.5939 6.6276 4.2838 7.3805 2.3271 1.1528 1.2893 3.0501 3.2507 2.8665 2.6889 2.3702 3.4867 1.1896 1.2315 3.4778 1.0778 1.0255 6.8698 5.1705 3.7481 4.0812 9.9829 11.2023 1.1153 1.1233 12.2892 2.0007 1.2349 1.4251 1.7539 9.9888 2.4611 2.1302 3.7103 2.9531 2.8295 1.6533 2.1433 2.2300 1.9905 2.4306 2.0467 2.4680 1.7072 1.3952 3.5363 1.3609 1.3197 1.2810 1.3238 1.3421 1.3828 1.2116 1.2109 4.3944 1.5758 1.1150 1.9414 1.0671 1.0631 1.0427 1.0479 1.0760 1.0735 4.7792 3.6728 2.3722 1.4028 2.3341 1.0358 1.0357 1.0611 1.0619 1.0657 1.0652 1.0963 1.0960 1.0989 1.0993 1.0992 1.0990 1.1019 1.1031 1.0437 1.0442 1.1058 1.1058
irintensity: 0.0288 0.0309 0.0070 1.8277 0.1649 0.0007 0.0940 14.8699 0.0880 3.0857 0.0071 0.8640 0.1316 0.6110 0.5758 3.2047 9.3322 5.5051 0.0089 582.4451 9.3688 7.2555 0.0101 3.8293 1.0206 5.7021 0.1536 0.1006 0.1239 4.4757 22.4193 37.2896 0.1278 0.9999 5.7735 27.6763 0.1244 0.0013 26.3024 0.8473 0.0538 1.9241 20.5063 14.1645 2.7246 17.4439 0.2580 0.1155 12.4514 0.9279 17.8655 0.0513 0.4951 15.1091 5.6147 71.6359 2.7181 25.4468 19.7404 12.6382 1.5528 89.3598 20.6199 0.6408 0.9491 3.0379 10.6463 17.2596 4.6758 33.3399 619.1163 730.2020 709.8687 582.1989 93.5243 52.3671 30.5632 3.1141 5.6777 80.5887 60.8814 2.2232 3.6791 3.9324 37.2269 89.2140 0.1953 46.7930 62.6203 114.1079 60.5884 19.2893 64.7612
temp: 298.150 k
press: 1.00000 atm
elementType: 7 7 7 7 7 7 6 6 6 6 6 6 6 6 6 1 1 1 1 1 1 1 1 1 1 1 1 1 1 1 1 1 1
symmnumber: 1
zpe: 736763.8 jmol-1
zpe.correction: 0.280619 hartree
zpe.thermalcorrener: 0.297357 hartree
zpe.thermalcorrenthalpy: 0.298301 hartree
zpe.thermalcorrgfe: 0.235337 hartree
zpe.sumelectzpe: -681.138196 hartree
zpe.sumelectthermal: -681.121457 hartree
zpe.sumelectthermalent: -681.120513 hartree
zpe.sumelectthermalfe: -681.183478 hartree
dipole: 0.3433 0.0001 0.0000
dipole: 0.3433
quadrupole: -79.8240 -78.5518 -92.9633
quadrupole: -0.0015 0.0034 -4.6236
quadrupole: 3.9557 5.2279 -9.1836 -0.0015 0.0034 -4.6236
hfenergy: -681.4188141 hartree
pointgroup: C01 [X(C9H18N6)]
dipole: -0.1350498 0.0002661 0.0000271 debye
polarizability: 186.5894131|-0.0413636|165.1228715|0.0128519|13.1241814|92.6072902 unknown
InChI: InChI=1S/C9H18N6/c1-3-5-15(6-4-2)9-13-7(10)12-8(11)14-9/h3-6,10-11H2,1-2H3
charge 0 multiplicity 1
33 atoms
N  -1.123338 0.002285 -0.001744
N  0.894999 1.169317 0.348695
N  0.89055 -1.172252 -0.352435
N  3.012737 -0.005379 -0.002251
N  2.953523 2.228607 0.688697
N  2.945033 -2.23915 -0.693101
C  -1.874628 1.212723 0.390483
C  -1.878982 -1.205652 -0.393387
C  -2.170605 2.154609 -0.801174
C  -2.175681 -2.147462 0.798141
C  0.25304 -0.000263 -0.001807
C  -3.006384 3.377972 -0.369037
C  -3.014892 -3.368596 0.366292
C  2.261785 1.094086 0.3355
C  2.257613 -1.10207 -0.339699
H  -2.823656 0.886561 0.859971
H  -1.28438 1.758872 1.145625
H  -1.291844 -1.753153 -1.149992
H  -2.827831 -0.876234 -0.86094
H  -1.204718 2.482382 -1.228068
H  -2.703674 1.592637 -1.593925
H  -1.210019 -2.477817 1.223529
H  -2.706411 -1.58469 1.591887
H  -3.985541 3.070709 0.045885
H  -2.479806 3.962093 0.409108
H  -3.1995 4.052193 -1.222877
H  -3.993832 -3.058804 -0.047254
H  -2.49058 -3.953439 -0.412836
H  -3.208539 -4.042889 1.219956
H  3.969358 2.206966 0.684113
H  2.435763 3.064437 0.944468
H  3.960943 -2.221251 -0.688886
H  2.424099 -3.073047 -0.948738
