program: Gaussian 09
title: 000121283
version: EM64L-G09RevD.01
frameworkgroup: C1[X(C15H21NO3)]
method: RPBEPBE
basis: SDD
operation: Freq
keyword: #p
keyword: freq=noraman
keyword: PBEPBE/SDD
title: #p freq=noraman PBEPBE/SDD
converged: YES YES NO NO
title: Mulliken charges:
elementType: O O O N C C C C C C C C C C C C C C C H H H H H H H H H H H H H H H H H H H H H
charge: -0.244466 -0.312053 -0.176930 -0.103892 -0.073192 -0.341936 -0.338991 -0.332903 -0.326868 -0.753354 0.144962 0.121519 0.335007 0.351737 -0.410547 -0.411727 -0.801035 -0.818780 -0.226515 0.224186 0.235438 0.188852 0.188727 0.220376 0.203055 0.214329 0.194978 0.213739 0.240243 0.233075 0.241396 0.235655 0.234423 0.242960 0.236750 0.223178 0.226974 0.228301 0.266797 0.226535
chargesum: 0.00000
title: Mulliken charges with hydrogens summed into heavy atoms:
elementType: O O O N C C C C C C C C C C C C C C C
charge: -0.244466 -0.312053 -0.176930 -0.103892 0.150994 0.082354 0.070112 0.084480 0.081849 -0.038641 0.144962 0.121519 0.335007 0.351737 -0.174892 -0.177304 -0.098147 -0.096709 0.000019
polarizability: 2.22187222e+02 8.56977564e+00 1.75224357e+02 1.32545236e+01 -6.75710048e+00 1.28871173e+02
1716.lowfreq: -14.1315 -5.7504 -0.0001 0.0001 0.0003 3.9168 7.4257 28.9140 41.2739
frequency: -3.8306 28.8788 41.2613 52.3217 70.1138 95.8360 109.4760 122.9360 148.2472 173.0352 182.0717 212.7971 225.4737 238.9221 247.1026 284.1976 293.2389 305.1611 318.9961 326.1240 386.8012 401.2992 460.6030 466.8012 473.3419 512.6640 514.2840 528.2060 541.5636 593.6838 655.3966 667.4836 693.1785 739.9146 755.0893 778.9403 798.3986 812.4305 844.4448 846.1211 897.5595 908.2671 920.5167 946.4229 976.1631 986.6178 1021.3387 1026.5850 1038.5015 1042.6971 1046.2032 1050.7418 1053.9772 1068.3130 1080.2625 1085.7866 1095.8521 1112.4104 1139.7955 1153.1812 1174.3470 1177.8110 1197.4124 1255.1439 1260.8634 1268.6198 1277.3834 1290.3343 1297.0299 1322.9859 1338.2087 1347.2980 1373.4848 1374.8941 1382.1088 1384.8095 1398.2404 1398.8363 1429.4578 1444.4898 1447.1561 1451.4726 1456.2331 1460.8330 1463.1736 1466.4004 1476.1559 1482.8685 1485.2396 1491.6829 1596.1490 1616.2675 1668.0427 2853.9776 2856.4569 2869.4269 2955.9775 2965.7777 2979.8832 2980.7960 2998.8916 3054.3529 3056.4831 3058.9524 3061.2978 3079.3803 3085.3213 3090.7732 3093.3275 3101.2481 3105.3068 3125.0188 3135.3201 3159.3998
redmass: 3.7591 4.0213 4.4368 5.2356 3.8441 3.5693 1.0375 3.1735 1.1908 3.8371 4.2997 1.5507 2.8317 2.0963 2.7333 2.9809 2.4000 3.2256 3.2562 3.0945 2.4321 2.8757 3.9355 3.0073 3.5510 3.6511 3.5729 4.8717 4.9594 2.0874 5.3530 4.6532 4.7160 3.4303 3.6807 1.2782 4.5174 4.0354 1.6046 4.1131 1.3104 2.5849 2.5080 2.2971 1.3366 1.6274 2.4436 2.1549 2.7384 1.8208 1.5543 1.5744 2.0991 2.3941 2.5111 2.0692 2.6130 2.3856 3.3674 3.3518 2.2188 1.1673 1.1182 1.2883 1.5578 1.2586 3.1223 1.3161 1.2367 1.4977 1.2705 1.3183 1.2855 6.5011 1.2117 1.4176 1.2615 1.2389 2.4345 1.0807 1.0826 1.0957 1.8159 1.1139 1.0570 1.0700 1.0828 1.2888 1.0910 1.1437 5.5917 8.1593 10.7923 1.0777 1.0722 1.0708 1.0665 1.0661 1.0379 1.0371 1.0349 1.0876 1.0895 1.0959 1.0975 1.0965 1.0982 1.0992 1.0996 1.0995 1.1009 1.0858 1.0921 1.0995
irintensity: 0.1323 0.2061 0.0886 0.1493 0.5755 1.6590 0.7500 3.3984 0.6580 6.4452 0.6088 0.0952 0.1311 3.2994 4.8966 6.1491 1.6417 5.7983 0.8450 9.1090 1.7165 4.6575 4.6625 1.2129 1.7696 0.9676 0.8086 0.6231 0.0694 6.3211 2.8276 2.9802 1.2447 4.9884 4.3641 46.4193 18.0562 24.6787 0.3457 7.0932 0.0554 9.8311 4.8231 41.5426 0.3905 10.3185 137.8285 5.7651 294.8704 12.0197 10.9725 25.2463 18.5382 12.2464 89.6212 105.2511 65.5345 47.4422 22.5318 28.7074 38.3063 1.6070 1.0391 39.3991 0.2961 9.8079 8.5993 9.6514 3.3126 3.9522 0.3810 10.9364 1.8499 4.0182 19.0656 0.6932 17.1337 3.4387 9.8765 2.5783 2.6177 17.3168 0.0832 0.9535 23.5035 14.0354 26.2591 32.1153 35.2168 20.8353 4.1502 3.2652 126.4744 41.4880 40.1867 143.0796 54.7305 72.4564 33.3643 13.8421 16.6999 31.5133 23.5950 18.1237 13.2020 42.1657 31.7244 25.7140 25.0089 27.6589 17.9376 0.0747 22.8144 30.9557
temp: 298.150 k
press: 1.00000 atm
elementType: 8 8 8 7 6 6 6 6 6 6 6 6 6 6 6 6 6 6 6 1 1 1 1 1 1 1 1 1 1 1 1 1 1 1 1 1 1 1 1 1
symmnumber: 1
zpe: 874594.8 jmol-1
zpe.correction: 0.333116 hartree
zpe.thermalcorrener: 0.351682 hartree
zpe.thermalcorrenthalpy: 0.352627 hartree
zpe.thermalcorrgfe: 0.286051 hartree
zpe.sumelectzpe: -863.143006 hartree
zpe.sumelectthermal: -863.124439 hartree
zpe.sumelectthermalent: -863.123495 hartree
zpe.sumelectthermalfe: -863.190070 hartree
dipole: -1.3858 1.0709 1.9932
dipole: 2.6533
quadrupole: -116.1257 -104.0454 -117.8273
quadrupole: 8.7671 5.4421 0.1025
quadrupole: -3.4596 8.6207 -5.1612 8.7671 5.4421 0.1025
hfenergy: -863.4761212 hartree
pointgroup: C01 [X(C15H21N1O3)]
dipole: -0.5352826 -0.4767192 -0.7589085 debye
polarizability: 222.3817184|-10.3500562|174.1128817|-10.3039548|-10.6677306|129.7881525 unknown
InChI: InChI=1S/C15H21NO3/c1-11-5-4-6-12(2)14(11)19-15(17)13(3)16-7-9-18-10-8-16/h4-6,13H,7-10H2,1-3H3
charge 0 multiplicity 1
40 atoms
O  5.166882 1.025302 0.489133
O  -0.910149 -0.310474 -0.785956
O  0.025912 -0.220526 1.362101
N  2.638145 -0.375851 0.092271
C  1.424008 -0.818147 -0.633047
C  2.696704 1.106033 0.239792
C  3.905509 -0.875484 -0.505332
C  3.91157 1.507672 1.089034
C  5.10175 -0.436969 0.356486
C  1.364557 -2.356261 -0.831864
C  0.157895 -0.409526 0.140959
C  -2.233792 0.02549 -0.322827
C  -2.712042 1.312251 -0.6693
C  -3.009083 -0.944376 0.356934
C  -4.044065 1.629059 -0.30657
C  -4.335598 -0.582008 0.701133
C  -1.8251 2.305942 -1.393226
C  -2.44921 -2.309311 0.703003
C  -4.850619 0.691364 0.375221
H  1.341873 -0.33847 -1.641645
H  1.781584 1.455027 0.749305
H  2.763008 1.609175 -0.758547
H  4.047842 -0.495061 -1.549314
H  3.892538 -1.978436 -0.539595
H  3.799187 1.089876 2.112008
H  4.01112 2.604238 1.14303
H  5.01886 -0.9016 1.362916
H  6.053404 -0.735908 -0.113662
H  0.381918 -2.639138 -1.244902
H  2.133498 -2.697058 -1.544673
H  1.51418 -2.870785 0.13326
H  -4.443928 2.617165 -0.56152
H  -4.96366 -1.310053 1.227348
H  -1.408247 1.872821 -2.320118
H  -0.964801 2.608159 -0.765961
H  -2.389444 3.216786 -1.654931
H  -3.248356 -2.983728 1.053178
H  -1.958984 -2.779468 -0.169176
H  -1.691881 -2.231202 1.505232
H  -5.879186 0.95098 0.648421
