program: Gaussian 09
title: 000121219
version: EM64L-G09RevD.01
frameworkgroup: C1[X(C9H11Cl2N3O4)]
method: RPBEPBE
basis: SDD
operation: Freq
keyword: #p
keyword: freq=noraman
keyword: PBEPBE/SDD
title: #p freq=noraman PBEPBE/SDD
converged: YES YES NO NO
title: Mulliken charges:
elementType: Cl Cl O O O O N N N C C C C C C C C C H H H H H H H H H H H
charge: -0.066694 -0.066673 -0.237879 -0.216816 -0.195597 -0.187995 -0.057520 -0.413660 0.052969 -0.302304 -0.302227 -0.556981 -0.557017 0.187491 0.242752 -0.291707 0.299233 -0.297322 0.230919 0.231790 0.231658 0.230964 0.331329 0.278724 0.277634 0.277503 0.278820 0.298936 0.299669
chargesum: 0.00000
title: Mulliken charges with hydrogens summed into heavy atoms:
elementType: Cl Cl O O O O N N N C C C C C C C C C
charge: -0.066694 -0.066673 -0.237879 -0.216816 -0.195597 -0.187995 -0.057520 -0.082331 0.052969 0.160405 0.160394 -0.000623 -0.000693 0.187491 0.242752 0.007229 0.299233 0.002347
polarizability: 2.09831841e+02 1.10797425e-02 1.33970271e+02 -4.11520959e+00 -9.48721839e-02 1.48661058e+02
1716.lowfreq: -3.3587 -0.0018 0.0006 0.0014 2.1739 3.0648 10.7184 14.2480 28.2231
frequency: 7.4304 14.1812 28.1572 47.1847 51.0429 63.7895 65.0508 74.3387 87.3911 103.3728 141.5979 188.2688 198.9386 204.3404 242.1570 253.4017 301.2544 308.1172 344.0238 382.7829 464.8907 473.2878 499.6174 554.7148 566.5638 587.0110 597.0816 674.9086 686.1205 694.2900 726.9520 736.7151 771.6216 777.2431 802.6599 840.2636 863.7941 910.0934 918.4301 919.4923 984.4140 995.4416 1016.7005 1046.1063 1061.0873 1078.2194 1102.3583 1129.8236 1149.8011 1185.8851 1213.8083 1228.0695 1229.6899 1253.7169 1258.1670 1278.7887 1293.7629 1306.7304 1342.7944 1345.2411 1364.9841 1377.0571 1447.8454 1452.4738 1458.6729 1464.0272 1482.3439 1514.2029 1566.5725 1610.0758 2948.2156 2954.3292 3068.6636 3075.3456 3076.2544 3081.4528 3163.9819 3164.8550 3244.2133 3261.2573 3386.4232
redmass: 12.0920 9.1363 9.4526 11.5254 11.9091 2.1148 2.7134 8.1264 5.3977 4.1283 5.9123 6.8362 13.3670 4.7066 6.2336 7.2717 4.8350 5.5504 5.5244 6.2257 6.8850 4.3881 2.6913 8.4716 5.4905 4.4951 1.5815 7.2072 8.5869 5.0398 5.6833 13.1066 1.1591 1.1545 7.0446 1.3326 7.1272 6.8803 1.3982 7.7897 1.5716 1.6471 1.2520 3.6034 2.5324 3.5576 1.4746 4.6919 3.2157 1.9531 2.0721 1.8731 2.8118 1.2211 1.2454 4.4001 1.2528 1.3202 1.3188 4.3682 9.0326 1.3129 1.0826 1.0944 1.0953 1.1801 2.6506 2.3847 5.9726 8.1830 1.0679 1.0690 1.0933 1.0642 1.0585 1.0864 1.1119 1.1119 1.0958 1.1045 1.0769
irintensity: 0.1322 0.3893 0.0163 1.7926 5.6586 2.0019 0.4932 8.1079 10.4973 0.3131 0.0407 7.9579 0.3054 10.3385 0.3566 7.9594 4.2652 1.2587 0.3652 10.3625 0.8744 5.8950 1.9116 0.4432 4.3843 1.0350 145.2065 31.3788 4.7494 79.8061 9.9832 22.6777 8.3293 18.0909 29.5519 56.5644 13.0186 8.9602 0.0154 15.8734 19.4487 14.5641 37.2660 1.3019 20.4225 0.3917 57.0020 7.4412 44.2238 17.3109 225.4269 9.9585 182.0936 25.2724 10.7663 56.1994 3.5680 15.0554 4.3116 15.0137 130.2955 0.4142 1.2749 0.5953 0.6104 55.5977 41.6194 67.4989 37.9814 144.6006 18.0638 54.4691 5.9225 10.8515 0.3358 29.2581 1.9910 23.6332 1.3791 8.7765 28.9253
temp: 298.150 k
press: 1.00000 atm
elementType: 17 17 8 8 8 8 7 7 7 6 6 6 6 6 6 6 6 6 1 1 1 1 1 1 1 1 1 1 1
symmnumber: 1
zpe: 537341.2 jmol-1
zpe.correction: 0.204662 hartree
zpe.thermalcorrener: 0.223599 hartree
zpe.thermalcorrenthalpy: 0.224543 hartree
zpe.thermalcorrgfe: 0.150700 hartree
zpe.sumelectzpe: -1733.320634 hartree
zpe.sumelectthermal: -1733.301697 hartree
zpe.sumelectthermalent: -1733.300753 hartree
zpe.sumelectthermalfe: -1733.374595 hartree
dipole: -0.0997 -0.0096 1.6137
dipole: 1.6168
quadrupole: -136.3101 -138.4010 -121.4431
quadrupole: -0.0572 20.5454 -0.0129
quadrupole: -4.2587 -6.3496 10.6083 -0.0572 20.5454 -0.0129
hfenergy: -1733.525296 hartree
pointgroup: C01 [X(C9H11Cl2N3O4)]
dipole: -0.0271759 0.0092051 -0.6354407 debye
polarizability: 209.650135|-0.5865893|133.9773464|5.2652188|-0.2543406|148.8356885 unknown
InChI: InChI=1S/C9H11Cl2N3O4/c10-3-5-13(6-4-11)12-9(15)7-1-2-8(18-7)14(16)17/h1-2,12H,3-6H2
charge 0 multiplicity 1
29 atoms
Cl -3.66427 -3.906536 0.323249
Cl -3.618393 3.94462 0.391122
O  1.799218 -0.016279 0.35168
O  -0.904319 0.024427 -2.101019
O  5.332043 -0.044798 0.93792
O  3.56132 -0.048986 2.407156
N  -2.33457 0.011109 0.39643
N  -0.932988 0.004333 0.263989
N  4.06719 -0.039761 1.219589
C  -2.901945 -1.275968 0.865485
C  -2.887496 1.296096 0.887666
C  -3.008727 -2.25267 -0.314712
C  -2.978866 2.295528 -0.27465
C  -0.312984 0.010914 -0.984162
C  1.172998 0.000828 -0.917855
C  2.140528 0.004768 -1.920388
C  3.171716 -0.022364 0.090852
C  3.424119 -0.010081 -1.276156
H  -3.908025 -1.084101 1.275651
H  -2.290147 -1.72959 1.675336
H  -2.27305 1.727226 1.707808
H  -3.897248 1.108764 1.290827
H  -0.347398 -0.006629 1.113829
H  -3.719968 -1.903852 -1.075368
H  -2.033812 -2.470427 -0.772718
H  -1.999893 2.510904 -0.725064
H  -3.691013 1.968425 -1.04402
H  1.929531 0.017001 -2.986892
H  4.407648 -0.011703 -1.738383
