program: Gaussian 09
title: 000121192
version: EM64L-G09RevD.01
frameworkgroup: C1[X(C8H3ClN2)]
method: RPBEPBE
basis: SDD
operation: Freq
keyword: #p
keyword: freq=noraman
keyword: PBEPBE/SDD
title: #p freq=noraman PBEPBE/SDD
converged: YES YES NO YES
title: Mulliken charges:
elementType: Cl N N C C C C C C C C H H H
charge: 0.025562 0.013098 0.005949 0.511033 0.424051 -0.295600 -0.347942 -0.342338 -0.363715 -0.224745 -0.240908 0.289917 0.273282 0.272357
chargesum: 0.00000
title: Mulliken charges with hydrogens summed into heavy atoms:
elementType: Cl N N C C C C C C C C
charge: 0.025562 0.013098 0.005949 0.511033 0.424051 -0.295600 -0.058025 -0.069056 -0.091358 -0.224745 -0.240908
polarizability: 1.81897637e+02 8.05602734e+00 1.02970313e+02 1.20840978e-03 -6.54481902e-03 3.93876672e+01
1716.lowfreq: -5.3588 0.0020 0.0026 0.0035 3.0726 9.3298 76.3950 118.9922 136.6714
frequency: 76.3939 118.9921 136.6713 151.0058 213.7673 276.6536 364.5493 372.1040 388.4135 451.7229 519.9629 528.9586 594.4540 626.5711 647.3120 685.3139 742.2759 856.7827 859.8261 908.5171 985.3048 1039.1002 1148.7487 1198.0422 1211.6247 1270.8915 1344.9520 1395.7584 1475.2292 1535.5749 1607.2942 2184.0330 2189.0673 3164.3875 3180.3259 3184.4550
redmass: 9.9568 13.0288 14.4989 6.0168 8.0063 8.5955 13.2189 6.5102 14.7227 3.7848 8.0972 10.2041 6.7526 4.0383 7.6064 7.5663 3.8326 7.8169 1.4282 1.4877 1.3834 3.4184 1.4815 2.0667 5.4579 1.4256 4.7053 4.2220 2.7796 7.4972 6.7799 12.6293 12.6298 1.0893 1.0942 1.0983
irintensity: 7.3795 7.7582 0.2352 0.1344 0.0481 0.0320 0.9610 0.0717 4.5008 6.6162 2.0999 1.0819 2.9179 7.3348 1.0038 10.8859 1.7781 26.7006 48.0103 25.5511 0.0690 22.1995 0.3408 8.1811 3.5014 3.7411 1.6489 29.9612 27.9414 24.1958 9.9659 2.5327 14.8213 0.4372 0.3345 0.9964
temp: 298.150 k
press: 1.00000 atm
elementType: 17 7 7 6 6 6 6 6 6 6 6 1 1 1
symmnumber: 1
zpe: 225107.5 jmol-1
zpe.correction: 0.085739 hartree
zpe.thermalcorrener: 0.095034 hartree
zpe.thermalcorrenthalpy: 0.095979 hartree
zpe.thermalcorrgfe: 0.050347 hartree
zpe.sumelectzpe: -875.444762 hartree
zpe.sumelectthermal: -875.435467 hartree
zpe.sumelectthermalent: -875.434523 hartree
zpe.sumelectthermalfe: -875.480154 hartree
dipole: 0.9298 -1.0226 -0.0001
dipole: 1.3821
quadrupole: -101.1675 -61.7201 -70.0432
quadrupole: -7.6927 0.0000 -0.0009
quadrupole: -23.5239 15.9235 7.6004 -7.6927 0.0000 -0.0009
hfenergy: -875.5305013 hartree
pointgroup: C01 [X(C8H3Cl1N2)]
dipole: 0.3078143 -0.4482412 -0.0000201 debye
dipolederiv: -0.2373561 0.2794339 -0.0000297 0.2930162 -0.5220554 0.0000551 -0.0000319 0.0000539 -0.0071963 -0.2590302 -0.0451025 0.0000022 -0.0353588 -0.2058158 -0.0000016 0.0000029 -0.000001 -0.2222999 -0.316581 0.0009778 0.000052 -0.0099147 -0.2009055 0.0000016 0.0000266 -0.0000007 -0.2248195 -0.0138942 0.0875965 -0.0000082 0.1353821 -0.0313638 0.0000199 -0.0000121 0.0000206 0.1555298 0.1005073 -0.0158003 -0.0000036 -0.041122 0.3072517 -0.0000185 0.0000071 -0.0000198 0.1347004 0.4036898 -0.6109994 0.0000634 -0.4501828 0.7960039 -0.0000943 0.0000418 -0.0000887 -0.0742026 -0.225923 0.2878175 -0.0000323 0.107138 -0.1625946 0.0000073 0.0000052 0.000009 -0.0839071 0.0297111 0.1040976 -0.0000123 -0.0078991 0.0467681 -0.0000166 -0.0000036 -0.0000213 -0.1156745 -0.0874857 -0.1754637 0.0000148 -0.0282414 -0.0418624 -0.0000083 0.0000174 -0.0000074 -0.138737 0.1785988 0.0801114 -0.0000077 0.0245214 -0.0006059 0.0000033 -0.0000021 0.0000024 0.0355538 0.2405207 0.0199158 -0.0000454 0.032987 -0.0647647 0.0000064 -0.000057 0.0000066 0.0274673 0.0844543 -0.0278136 0.0000051 -0.0330083 0.044294 0.0000132 0.0000048 0.0000144 0.1727643 0.0571719 -0.0441708 0.0000052 -0.0415702 0.0064282 0.0000176 0.0000035 0.0000187 0.1683808 0.0456165 0.0593998 -0.0000036 0.0542527 0.0292222 0.0000149 -0.0000029 0.0000134 0.1724406 unknown
polarizability: 182.610189|-2.855173|102.2577608|0.0003088|-0.0066483|39.3876672 unknown
InChI: InChI=1S/C8H3ClN2/c9-8-3-6(4-10)1-2-7(8)5-11/h1-3H
charge 0 multiplicity 1
14 atoms
Cl -1.627078 2.433906 -0.00023
N  -3.878024 -0.620275 0.000143
N  4.19923 0.082323 0.000082
C  -1.260857 -0.341857 0.000072
C  1.572295 -0.123637 0.000006
C  -0.625271 0.930776 -0.000072
C  0.772982 1.051675 -0.000106
C  -0.443528 -1.508357 0.000181
C  0.956882 -1.40638 0.000152
C  -2.691735 -0.474026 0.000104
C  3.007298 -0.009036 -0.000035
H  1.242138 2.038779 -0.00022
H  -0.927668 -2.489014 0.000289
H  1.577837 -2.306177 0.000234
