program: Gaussian 09
title: 000121343
version: EM64L-G09RevD.01
frameworkgroup: C1[X(C16H18N4O6)]
method: RPBEPBE
basis: SDD
operation: Freq
keyword: #p
keyword: freq=noraman
keyword: PBEPBE/SDD
title: #p freq=noraman PBEPBE/SDD
converged: YES YES NO NO
title: Mulliken charges:
elementType: O O O O O O N N N N C C C C C C C C C C C C C C C C H H H H H H H H H H H H H H H H H H
charge: -0.468162 -0.338093 -0.240622 -0.229790 -0.264450 -0.260686 -0.240430 -0.385991 -0.657806 -0.619533 -0.164404 -0.202095 0.206356 -0.423183 0.173910 0.080207 0.144843 -0.407565 -0.090016 -0.229466 0.272852 0.232719 0.260357 -0.848370 -0.777186 0.296142 0.318303 0.247948 0.273797 0.273351 0.308237 0.273044 0.264385 0.369854 0.289243 0.222099 0.223459 0.355963 0.335900 0.256560 0.258061 0.211416 0.355269 0.343573
chargesum: 0.00000
title: Mulliken charges with hydrogens summed into heavy atoms:
elementType: O O O O O O N N N N C C C C C C C C C C C C C C C C
charge: -0.098308 -0.338093 -0.240622 -0.229790 -0.264450 -0.260686 -0.240430 -0.077754 0.034057 0.079310 0.153898 0.045853 0.206356 0.123966 0.173910 0.080207 0.144843 0.129865 -0.090016 -0.229466 0.272852 0.232719 0.260357 -0.113568 -0.051149 0.296142
polarizability: 3.23362459e+02 8.35127018e+00 2.50219279e+02 1.63702910e+01 1.96115930e+01 1.42322741e+02
1716.lowfreq: -6.9636 -3.9305 -0.0004 -0.0001 0.0004 5.2998 20.4091 24.7825 30.2836
frequency: 20.3563 24.7724 30.2370 43.6713 60.1095 63.7249 72.8533 83.6970 89.8454 114.9137 115.7690 132.3521 143.4008 158.5961 159.0892 182.9006 185.7041 226.6116 234.9050 272.3762 276.0253 286.3401 307.4428 320.5665 327.2011 355.4905 367.0896 395.0552 406.4843 439.8797 444.0956 474.2962 486.6368 505.1162 519.8330 537.8432 542.6796 546.3127 570.3099 579.2754 596.0387 606.6942 638.6145 641.4261 646.4358 647.9203 673.1521 697.8690 707.2056 727.0105 737.6091 749.6645 810.8672 824.9969 828.1585 863.1266 876.2246 906.9327 931.3335 952.7776 978.7547 986.3535 991.0127 998.5118 1016.7138 1038.4998 1041.0162 1044.5810 1076.5700 1085.8336 1114.7898 1164.4461 1172.1436 1180.3854 1198.1319 1206.3888 1220.7249 1241.5475 1266.0325 1283.8077 1289.8672 1302.5853 1316.2034 1318.0624 1338.6947 1353.0993 1367.1704 1372.6745 1390.1657 1393.1028 1450.0046 1451.6974 1457.7249 1464.7704 1466.7730 1472.5055 1474.5351 1474.9985 1485.5566 1485.9295 1519.9693 1561.8500 1568.9939 1589.7066 1605.1277 1625.4391 1633.2366 1701.2373 2954.6008 2997.9203 3008.0926 3015.6800 3022.9040 3035.3031 3079.3899 3083.8847 3093.7389 3099.6787 3100.9516 3110.5683 3465.3726 3484.8575 3488.3473 3541.2245 3672.0993 3672.7942
redmass: 7.0064 5.9036 6.3820 5.0343 3.0496 5.3278 1.4439 3.8538 4.1482 6.4547 6.3482 4.4321 4.5284 1.0963 4.9445 5.9307 6.1304 3.9957 6.9336 3.4661 3.8723 3.3359 4.8323 3.9063 4.2216 5.8805 5.4836 6.8264 3.9968 1.6364 2.4700 3.7036 3.8324 2.5758 3.0831 1.7837 1.3519 2.6051 1.9622 3.5399 4.0768 2.1618 2.2721 1.6681 4.3344 1.1688 5.7061 8.3443 6.0166 3.6958 8.9204 6.4566 5.4145 7.4154 6.0326 2.2943 4.4130 3.5549 4.3458 4.0850 2.7984 3.3696 1.6407 2.9087 2.2506 1.4669 1.9328 2.0436 2.9217 2.0610 2.5960 1.7025 1.9801 2.0842 1.2417 1.6954 2.2861 1.8370 1.5147 1.4465 2.6284 1.4319 2.3064 2.0495 1.7103 2.0161 2.7877 2.3688 1.2252 1.6169 1.0553 5.0800 2.6661 2.0712 1.5134 1.3126 1.6153 1.3275 1.1118 1.4647 7.4421 3.1537 8.8664 2.6109 1.1858 6.3215 3.2400 8.0690 1.0391 1.0361 1.0622 1.0866 1.0978 1.0631 1.0857 1.1010 1.0948 1.0989 1.0997 1.1030 1.0642 1.0530 1.0491 1.0778 1.0991 1.0997
irintensity: 4.0928 0.7295 3.4868 2.5924 10.8512 15.6728 1.3570 1.7919 3.8494 2.4513 6.4730 0.7330 3.8531 0.2372 16.4915 8.1314 6.8070 11.0161 2.5743 23.6958 3.1684 5.4533 2.0301 10.6622 0.5531 6.8666 12.1532 29.8135 12.9636 66.0539 16.4110 27.3450 17.6766 22.0332 60.6371 35.0889 149.8539 20.4202 77.2782 27.5026 8.9933 8.0627 131.4070 77.9280 2.1404 139.3866 1.0614 15.3060 28.7367 3.5852 4.9859 6.4148 41.1873 4.2327 12.0346 6.4560 2.7714 4.6824 52.2713 9.2501 68.1011 157.8941 6.9031 1.2943 38.8556 0.7268 8.8409 6.1724 196.0586 1.3501 30.1538 29.4789 1.1815 27.5305 3.6101 5.9433 14.3002 80.6766 34.4929 233.1789 250.8352 15.7504 41.5993 85.7282 26.7013 97.4854 46.7889 46.2791 76.6703 63.1074 12.1908 46.2048 65.8508 155.6946 87.4757 15.7315 96.3329 74.2586 39.2528 81.9326 213.5567 451.9466 51.9733 80.6981 102.5887 213.0318 129.4264 344.8684 45.9157 9.2526 15.3139 36.5694 25.7870 6.4071 13.8844 3.2215 1.6496 11.2921 15.1130 6.9400 21.3098 75.7028 128.3231 12.1530 70.2204 94.0796
temp: 298.150 k
press: 1.00000 atm
elementType: 8 8 8 8 8 8 7 7 7 7 6 6 6 6 6 6 6 6 6 6 6 6 6 6 6 6 1 1 1 1 1 1 1 1 1 1 1 1 1 1 1 1 1 1
symmnumber: 1
zpe: 881248.5 jmol-1
zpe.correction: 0.335650 hartree
zpe.thermalcorrener: 0.361030 hartree
zpe.thermalcorrenthalpy: 0.361975 hartree
zpe.thermalcorrgfe: 0.278509 hartree
zpe.sumelectzpe: -1288.996518 hartree
zpe.sumelectthermal: -1288.971138 hartree
zpe.sumelectthermalent: -1288.970193 hartree
zpe.sumelectthermalfe: -1289.053659 hartree
dipole: 2.8720 -0.4667 2.0687
dipole: 3.5701
quadrupole: -129.2259 -172.4065 -151.9961
quadrupole: -6.6757 -8.2739 -17.9114
quadrupole: 21.9836 -21.1970 -0.7866 -6.6757 -8.2739 -17.9114
hfenergy: -1289.332168 hartree
pointgroup: C01 [X(C16H18N4O6)]
dipole: 0.5590922 -0.9921191 0.8221954 debye
polarizability: 286.8848104|-37.9199203|284.2776885|31.0540293|0.9833193|144.74198 unknown
InChI: InChI=1S/C16H18N4O6/c1-5-10(17)15(24)9-7(4-26-16(18)25)11-14(23)8(19-6(2)21)3-20(11)12(9)13(5)22/h8,14,19,23H,3-4,17-18H2,1-2H3
charge 0 multiplicity 1
44 atoms
O  -0.848242 2.26108 -1.851998
O  1.572379 2.83573 -0.426642
O  -0.759219 -3.666649 -0.569697
O  3.937083 -1.030475 0.756174
O  -5.052644 1.884307 -0.6186
O  1.849974 4.302032 1.407753
N  -0.574266 -0.6984 -0.3904
N  -3.29755 0.843247 0.502815
N  3.961645 -3.705451 0.624718
N  0.390096 4.78309 -0.375382
C  -2.442929 0.739996 -0.68641
C  -1.139684 1.608979 -0.548091
C  -0.087651 0.599325 -0.189974
C  -1.956216 -0.728635 -0.923404
C  1.274394 0.528105 0.150038
C  0.426874 -1.614272 -0.171096
C  1.592939 -0.879153 0.172915
C  2.190184 1.706716 0.32766
C  0.345681 -3.084418 -0.260758
C  2.828242 -1.587533 0.450431
C  1.592095 -3.808818 0.021425
C  2.755495 -3.107492 0.351202
C  -4.566846 1.418517 0.45389
C  1.581275 -5.318981 -0.058453
C  -5.324695 1.442972 1.776923
C  1.308629 4.026885 0.311912
H  -3.0410 1.121392 -1.530317
H  -1.286445 2.395703 0.214299
H  -2.569916 -1.479447 -0.403241
H  -1.929227 -0.987988 -1.995656
H  -2.950458 0.475643 1.391017
H  2.319849 2.023502 1.379771
H  3.187608 1.511608 -0.098391
H  0.145441 2.322714 -1.906483
H  0.569278 -5.662321 -0.32685
H  1.855255 -5.787226 0.908481
H  2.284129 -5.69821 -0.827575
H  4.745415 -3.088299 0.853967
H  4.083323 -4.713918 0.600695
H  -5.567306 2.488676 2.033067
H  -6.282222 0.908965 1.651879
H  -4.769663 0.989691 2.616492
H  -0.127218 4.387678 -1.16518
H  0.151315 5.701331 -0.009526
