program: Gaussian 09
title: 000121191
version: EM64L-G09RevD.01
frameworkgroup: C1[X(C8H2Cl2N2)]
method: RPBEPBE
basis: SDD
operation: Freq
keyword: #p
keyword: freq=noraman
keyword: PBEPBE/SDD
title: #p freq=noraman PBEPBE/SDD
converged: NO NO NO NO
title: Mulliken charges:
elementType: Cl Cl N N C C C C C C C C H H
charge: 0.038434 0.038436 0.019453 0.019466 0.556527 0.556533 -0.336777 -0.336779 -0.346180 -0.346154 -0.225674 -0.225686 0.294204 0.294198
chargesum: 0.00000
title: Mulliken charges with hydrogens summed into heavy atoms:
elementType: Cl Cl N N C C C C C C C C
charge: 0.038434 0.038436 0.019453 0.019466 0.556527 0.556533 -0.336777 -0.336779 -0.051976 -0.051956 -0.225674 -0.225686
polarizability: 1.89281669e+02 -1.90632163e+01 1.27457531e+02 9.59512976e-04 1.06513537e-03 4.21543459e+01
1716.lowfreq: -10.4969 -9.9831 0.0015 0.0017 0.0031 4.9577 63.4785 110.2003 122.8443
frequency: 63.4785 110.2003 122.8443 127.9837 172.2186 191.4951 284.7712 306.0279 321.4816 374.1384 390.0856 441.9543 467.0870 523.9825 563.7757 625.3516 676.4734 687.1253 691.8805 739.1401 909.1279 914.9309 916.6045 1064.6199 1174.6410 1227.6292 1255.7731 1329.5478 1373.9462 1463.6384 1526.4963 1602.3036 2182.2532 2186.7892 3176.3557 3178.0843
redmass: 17.6599 11.9495 14.1756 17.6217 6.5201 18.5722 10.1495 13.9471 13.6569 6.4819 12.9453 14.9532 3.8387 10.6544 10.8351 6.9615 10.0166 7.6235 7.5465 3.3462 1.5539 1.4302 11.2962 3.9078 2.0177 9.1955 1.2300 7.1917 11.3891 3.1222 9.4943 7.8600 12.6271 12.6255 1.0937 1.0943
irintensity: 2.1437 4.6329 5.8681 0.0000 0.0000 0.7209 0.0000 0.0000 0.0000 0.0527 0.0000 9.9216 16.0080 0.0000 11.2707 0.0000 0.3907 0.0000 34.0049 0.0000 0.0000 47.3713 0.0000 99.7516 0.2458 0.0000 0.0000 32.3962 35.1411 69.2488 0.0000 0.0000 0.0000 7.6396 2.6771 0.0000
temp: 298.150 k
press: 1.00000 atm
elementType: 17 17 7 7 6 6 6 6 6 6 6 6 1 1
symmnumber: 1
zpe: 199562.5 jmol-1
zpe.correction: 0.076009 hartree
zpe.thermalcorrener: 0.086589 hartree
zpe.thermalcorrenthalpy: 0.087534 hartree
zpe.thermalcorrgfe: 0.038537 hartree
zpe.sumelectzpe: -1334.827256 hartree
zpe.sumelectthermal: -1334.816675 hartree
zpe.sumelectthermalent: -1334.815731 hartree
zpe.sumelectthermalfe: -1334.864728 hartree
dipole: -0.0002 -0.0004 0.0004
dipole: 0.0006
quadrupole: -106.5533 -83.1893 -81.5377
quadrupole: 14.9672 -0.0002 0.0004
quadrupole: -16.1265 7.2374 8.8891 14.9672 -0.0002 0.0004
hfenergy: -1334.9032649 hartree
pointgroup: C01 [X(C8H2Cl2N2)]
dipole: -0.0000171 0.0001823 -0.0001692 debye
dipolederiv: -0.305522 0.3168749 0.0000183 0.3312991 -0.4584164 -0.0000276 0.0000468 -0.0000597 0.0030912 -0.305503 0.3168713 0.0000003 0.331292 -0.4583898 -0.0000009 -0.0000096 0.0000067 0.0030938 -0.2079237 -0.0356668 -0.000057 -0.0332103 -0.2014193 -0.0000104 -0.0000292 -0.0000016 -0.2143908 -0.2078721 -0.0358303 0.0000186 -0.0332375 -0.2014332 0.0000029 0.0000069 -0.0000029 -0.2143844 0.0247535 0.0704656 0.0000014 0.1118436 0.1016386 -0.0000138 -0.0000325 -0.0000463 0.1654509 0.0247721 0.0704517 0.0000059 0.1117654 0.101626 0.000003 -0.0000015 0.0000081 0.1654567 0.4826543 -0.6849451 -0.0000459 -0.5126462 0.6358341 0.0000555 -0.0000717 0.0001115 -0.0908085 0.4826056 -0.6849409 0.0000048 -0.5125904 0.635822 -0.0000029 0.00002 -0.0000206 -0.0908094 -0.181966 0.2551617 0.0000043 0.0834208 -0.1229676 -0.0000009 0.0000067 0.0000146 -0.0688347 -0.1819727 0.2551804 0.0000197 0.083469 -0.1229592 -0.0000091 0.0000217 -0.0000216 -0.0688386 0.1037109 0.0890152 0.0000428 0.0380864 0.001667 0.000009 0.0000657 0.0000105 0.0331466 0.1036383 0.0891696 -0.0000091 0.0381574 0.0016776 -0.0000016 -0.0000085 0.0000109 0.0331393 0.084308 -0.0109026 -0.0000011 -0.0188213 0.0436626 0.0000004 -0.0000071 0.0000038 0.1723441 0.0843169 -0.0109047 -0.000003 -0.0188279 0.0436578 -0.0000037 -0.0000075 -0.0000134 0.1723438 unknown
polarizability: 194.1685262|-6.1154798|122.5706738|-0.0005216|0.0013353|42.1543459 unknown
InChI: InChI=1S/C8H2Cl2N2/c9-7-1-5(3-11)8(10)2-6(7)4-12/h1-2H
charge 0 multiplicity 1
14 atoms
Cl -2.070667 2.44716 0.000134
Cl 2.070691 -2.447099 0.00004
N  -3.968855 -0.834685 0.000239
N  3.968978 0.834249 0.000221
C  -1.398464 -0.267811 -0.000052
C  1.398463 0.26787 0.000031
C  -0.91038 1.06903 -0.000033
C  0.910395 -1.068968 0.000005
C  -0.46491 -1.337673 -0.000041
C  0.464918 1.337728 -0.000005
C  -2.804906 -0.559624 0.00004
C  2.804918 0.559672 0.000114
H  -0.829853 -2.368248 -0.000039
H  0.829873 2.3683 0.000046
