program: Gaussian 09
title: 000121218
version: EM64L-G09RevD.01
frameworkgroup: C1[X(C11H16NO3P)]
method: RPBEPBE
basis: SDD
operation: Freq
keyword: #p
keyword: freq=noraman
keyword: PBEPBE/SDD
title: #p freq=noraman PBEPBE/SDD
converged: YES YES NO NO
title: Mulliken charges:
elementType: P O O O N C C C C C C C C C C C H H H H H H H H H H H H H H H H
charge: 1.347016 -0.487895 -0.514592 -0.577950 -0.525896 -0.309479 -0.300253 -0.410725 0.295684 0.262764 -0.638916 -0.644663 -0.388999 -0.354787 -0.234692 -0.204285 0.255517 0.212599 0.231388 0.219672 0.223891 0.244190 0.206058 0.242020 0.216938 0.211662 0.252781 0.211838 0.235774 0.258148 0.231516 0.233675
chargesum: 0.00000
title: Mulliken charges with hydrogens summed into heavy atoms:
elementType: P O O O N C C C C C C C C C C C
charge: 1.347016 -0.487895 -0.514592 -0.577950 -0.525896 0.158638 0.150806 0.057357 0.295684 0.262764 0.026100 0.031618 -0.153225 -0.096639 -0.003176 0.029390
polarizability: 2.15464652e+02 1.91964664e+00 1.14809439e+02 3.37761364e-02 -5.86831091e-01 1.40920526e+02
1716.lowfreq: -14.9309 -7.9040 -4.1930 -0.0011 -0.0008 0.0015 29.1558 34.1320 51.8995
frequency: 28.8561 34.0379 51.7964 62.9919 81.2366 112.8950 149.3800 165.7555 168.9268 202.8070 231.3999 242.2979 270.8480 279.1385 310.7176 315.3372 365.8150 386.5340 399.6785 437.7284 450.3214 490.5273 520.3135 548.5735 586.1068 616.9504 627.4759 686.5584 722.0184 759.7506 765.2322 771.9016 782.1509 843.3790 871.6754 914.4521 922.5609 926.9525 942.0316 973.7519 984.3607 1024.1781 1028.3473 1061.9022 1076.3237 1080.9188 1096.1771 1098.4027 1168.3522 1173.1876 1184.7901 1189.5677 1203.9277 1228.2010 1274.6611 1282.3127 1331.1046 1332.3316 1341.1586 1362.4104 1384.6573 1387.3045 1391.8335 1441.0936 1453.4199 1462.7993 1466.7237 1468.3329 1471.5198 1475.7305 1480.5308 1486.8093 1589.7341 1615.3299 2970.9064 2983.3163 2983.9524 2991.3177 2995.4145 3046.7051 3060.6329 3078.7491 3079.9773 3087.4912 3098.2288 3100.2650 3126.2241 3141.3278 3161.9572 3177.1176
redmass: 3.3536 4.9946 2.9465 2.7663 3.5877 4.2879 3.1758 3.9847 2.7192 1.1512 1.5535 3.1714 6.6317 2.7126 2.8419 3.7026 5.9903 4.9692 3.8310 5.5201 3.7661 3.5507 4.3197 5.5968 4.9924 6.4713 8.6708 4.6652 3.2962 5.0116 1.3729 1.1726 1.1945 3.2607 1.6615 6.9246 2.1108 2.3465 1.4669 1.7894 1.3318 2.6451 2.0932 10.0176 2.1781 1.9680 2.1786 1.7310 1.1044 2.3259 1.4776 2.0331 1.9358 2.4496 1.3765 1.1902 1.3291 1.2648 1.2843 1.2861 1.2250 6.6127 1.2171 2.2769 1.1575 1.0661 1.0800 1.0528 2.2311 1.0604 1.0658 1.0592 6.7003 7.3110 1.0672 1.0364 1.0360 1.0625 1.0621 1.1012 1.0993 1.0989 1.0987 1.0968 1.1017 1.1015 1.0880 1.0893 1.0953 1.0987
irintensity: 0.4353 1.9092 0.7739 0.6048 2.4147 0.9081 0.8740 0.9848 1.7551 1.5195 0.2184 7.3806 17.2436 5.6330 1.8062 13.8283 8.0990 5.1898 12.3485 20.7561 9.9875 13.2831 11.9268 0.8613 12.7947 55.6540 76.1320 112.1493 40.8532 59.7050 83.6949 27.4072 45.2053 31.1199 22.5724 147.2151 28.1944 86.4607 2.7355 7.3196 0.0938 118.4820 7.7808 102.1433 20.3143 17.2488 56.6696 12.9963 7.0426 130.3843 40.5030 53.5113 33.4510 13.4549 0.6583 14.0224 4.2711 8.3818 5.3812 20.0560 21.1507 0.3065 27.8235 41.7322 2.5154 11.3201 2.5123 4.4937 69.0859 4.5112 16.1531 18.4077 20.4286 22.4864 42.6767 17.7900 27.8213 41.8393 39.6130 10.8657 2.2964 51.8181 29.0707 11.1626 14.5412 48.2367 5.0216 11.2369 23.9551 9.3404
temp: 298.150 k
press: 1.00000 atm
elementType: 15 8 8 8 7 6 6 6 6 6 6 6 6 6 6 6 1 1 1 1 1 1 1 1 1 1 1 1 1 1 1 1
symmnumber: 1
zpe: 671122.3 jmol-1
zpe.correction: 0.255617 hartree
zpe.thermalcorrener: 0.272503 hartree
zpe.thermalcorrenthalpy: 0.273447 hartree
zpe.thermalcorrgfe: 0.210048 hartree
zpe.sumelectzpe: -1049.181492 hartree
zpe.sumelectthermal: -1049.164606 hartree
zpe.sumelectthermalent: -1049.163662 hartree
zpe.sumelectthermalfe: -1049.227061 hartree
dipole: -0.1296 3.8394 1.5728
dipole: 4.1511
quadrupole: -81.3064 -112.9900 -97.7135
quadrupole: 4.2497 -2.2041 -0.4871
quadrupole: 16.0303 -15.6534 -0.3769 4.2497 -2.2041 -0.4871
hfenergy: -1049.4371087 hartree
pointgroup: C01 [X(C11H16N1O3P1)]
dipole: 0.0352732 -0.8529361 1.3923031 debye
polarizability: 213.7845536|-10.0119473|125.7830381|-5.506102|13.4328898|131.6270255 unknown
InChI: InChI=1S/C11H16NO3P/c1-3-12(4-2)16(13)14-9-10-7-5-6-8-11(10)15-16/h5-8H,3-4,9H2,1-2H3
charge 0 multiplicity 1
32 atoms
P  -0.873435 0.793617 -0.265715
O  -0.055465 1.680341 0.997623
O  0.076127 -0.731491 -0.195208
O  -0.93173 1.496078 -1.685977
N  -2.389266 0.347214 0.373056
C  -3.608505 0.495461 -0.46543
C  -2.5213 -0.22361 1.734124
C  1.168099 1.104768 1.644042
C  2.074279 0.355299 0.692402
C  1.491661 -0.580818 -0.199787
C  -4.447518 1.732551 -0.088265
C  -2.575279 -1.766011 1.749219
C  3.478866 0.506043 0.688563
C  2.270309 -1.369644 -1.065398
C  4.280724 -0.287072 -0.164858
C  3.676256 -1.22625 -1.033826
H  -3.293645 0.56653 -1.521326
H  -4.207011 -0.430437 -0.360422
H  -1.677357 0.138439 2.349572
H  -3.438414 0.200762 2.186451
H  0.823356 0.435706 2.459047
H  1.671415 1.979464 2.085713
H  -4.748274 1.712785 0.975041
H  -3.873384 2.657144 -0.27017
H  -5.368235 1.768091 -0.700006
H  -3.428373 -2.142415 1.156422
H  -1.647879 -2.18618 1.324472
H  -2.693882 -2.134949 2.785271
H  3.947147 1.236682 1.359083
H  1.775065 -2.067768 -1.746362
H  5.369141 -0.168522 -0.1573
H  4.296606 -1.835608 -1.69975
