program: Gaussian 09
title: 000121190
version: EM64L-G09RevD.01
frameworkgroup: C1[X(C9H13NO)]
method: RPBEPBE
basis: SDD
operation: Freq
keyword: #p
keyword: freq=noraman
keyword: PBEPBE/SDD
title: #p freq=noraman PBEPBE/SDD
converged: YES YES NO NO
title: Mulliken charges:
elementType: O N C C C C C C C C C H H H H H H H H H H H H H
charge: -0.280471 -0.236343 -0.544167 0.488591 -0.393888 -0.402280 -0.419192 -0.227698 -0.224547 -0.243948 -0.478945 0.229989 0.217598 0.225999 0.221101 0.237197 0.232752 0.276718 0.223318 0.223080 0.226652 0.210444 0.219712 0.218328
chargesum: 0.00000
title: Mulliken charges with hydrogens summed into heavy atoms:
elementType: O N C C C C C C C C C
charge: -0.280471 0.040375 -0.096580 0.488591 0.053213 -0.165083 -0.186440 -0.004380 -0.001467 -0.017296 0.169540
polarizability: 1.44967728e+02 -1.93581705e+00 1.03691915e+02 7.74336578e+00 2.83512850e+00 6.80914967e+01
1716.lowfreq: -7.9323 0.0008 0.0008 0.0010 6.1037 8.5893 26.8824 41.5587 56.0233
frequency: 26.7088 41.5396 56.0214 97.2009 116.3597 185.1991 260.3233 269.7421 339.8880 383.4400 404.3838 449.2546 499.6592 596.3222 617.9074 705.7516 713.3249 756.2495 800.4629 816.8870 855.4324 906.4283 918.4553 974.2096 976.6315 989.8830 993.7918 1009.5228 1026.9766 1030.0451 1091.6077 1104.9000 1115.5995 1144.5352 1171.2316 1186.5924 1191.0752 1216.5145 1274.0390 1288.3866 1326.9904 1344.4040 1382.1189 1401.5668 1417.1320 1439.9778 1440.6609 1445.7230 1477.6987 1483.2259 1486.0504 1592.5803 1614.6053 2941.7908 2958.5652 3002.2848 3018.8652 3050.8398 3067.4373 3092.8898 3114.2860 3115.2360 3130.7578 3142.2200 3160.9814 3306.9541
redmass: 3.3704 3.7429 2.7966 3.6232 2.3002 1.3167 2.7813 3.8701 2.5315 2.9999 2.8263 3.7485 3.1095 4.4778 6.3648 1.8636 3.2251 1.9135 1.2742 3.4707 1.2462 1.8869 1.6452 3.5722 1.3872 6.2057 1.3279 2.5097 2.1764 2.8062 1.5406 1.5291 1.4773 1.4174 1.0543 1.1175 1.3383 2.2785 1.3532 1.2098 1.2590 1.2359 8.0610 1.2338 1.1455 1.9754 1.1194 1.0888 1.0650 1.8488 1.2453 6.0632 6.1750 1.0622 1.0296 1.0591 1.0963 1.1039 1.1042 1.1020 1.0859 1.0876 1.0910 1.0959 1.1015 1.0757
irintensity: 0.0566 0.2276 3.2237 1.9101 1.2961 3.4610 14.3550 1.0063 1.1545 18.2828 0.0124 0.7198 20.3157 11.4426 0.1453 47.5558 24.6288 44.5289 6.8075 8.5902 0.0367 55.8561 28.0164 15.3800 0.0265 0.0100 0.8804 7.7907 6.9120 6.0606 12.0767 2.2563 3.0113 1.9235 0.0676 0.1457 0.9705 0.3695 6.3271 2.8765 0.5753 8.5694 0.1520 4.7449 1.1994 7.4155 7.4376 4.3450 7.2892 26.0304 5.8999 1.3122 9.7959 51.0505 68.5694 27.8004 12.9356 64.3835 23.2191 30.2910 9.8602 4.5081 12.1666 47.4345 23.6152 8.4253
temp: 298.150 k
press: 1.00000 atm
elementType: 8 7 6 6 6 6 6 6 6 6 6 1 1 1 1 1 1 1 1 1 1 1 1 1
symmnumber: 1
zpe: 529696.4 jmol-1
zpe.correction: 0.201751 hartree
zpe.thermalcorrener: 0.213065 hartree
zpe.thermalcorrenthalpy: 0.214010 hartree
zpe.thermalcorrgfe: 0.162588 hartree
zpe.sumelectzpe: -479.823245 hartree
zpe.sumelectthermal: -479.811931 hartree
zpe.sumelectthermalent: -479.810986 hartree
zpe.sumelectthermalfe: -479.862408 hartree
dipole: -0.4141 -0.5182 0.2850
dipole: 0.7219
quadrupole: -59.0376 -63.3287 -66.3927
quadrupole: 0.6802 2.0796 -1.2862
quadrupole: 3.8821 -0.4090 -3.4730 0.6802 2.0796 -1.2862
hfenergy: -480.0249961 hartree
pointgroup: C01 [X(C9H13N1O1)]
dipole: 0.1598642 -0.2024271 -0.1188922 debye
dipolederiv: -0.6885566 -0.0413644 -0.1110132 -0.2042544 -0.3437626 -0.1325853 -0.0908649 0.0579748 -0.4081737 -0.2650217 0.1884545 0.031596 0.3187818 -0.1298467 0.1375086 -0.0467148 0.064216 -0.0253074 -0.1327482 0.0192865 0.05426 0.029862 0.1234431 -0.0034286 0.202367 -0.0479528 0.0186339 0.4303701 -0.0497265 -0.0163813 -0.0649101 -0.0277535 0.0038805 0.0351505 -0.0002583 -0.0694088 0.4487739 -0.0555938 -0.0281114 -0.0814877 0.2297823 -0.0413168 -0.298358 -0.0233139 0.1878029 -0.1226151 0.0724721 0.0116605 0.1459107 0.0146201 -0.027503 -0.0262915 -0.0233381 -0.1556203 -0.1779524 -0.0227963 0.0279416 -0.0718494 0.0649412 -0.0481433 0.0291511 -0.0418725 -0.1571224 -0.0062845 -0.0353085 0.0180408 -0.062047 0.106416 -0.0425891 0.0228194 -0.0474127 -0.138703 0.0332874 0.0672577 0.0034268 0.0823541 0.0697279 -0.0357272 -0.0005048 -0.0360867 -0.1384308 0.0544443 -0.0204994 0.0323199 -0.0131518 -0.0963736 -0.017709 0.0207662 -0.0160215 -0.1741023 0.5635945 0.0115019 0.1085525 -0.0758346 0.2316427 -0.0231243 0.2368013 0.0350567 0.4348628 0.0325599 -0.0306981 -0.0531889 -0.0686621 -0.0403308 -0.0896554 -0.0555694 -0.0484639 0.024172 0.0361398 0.0165298 -0.012867 0.0551041 -0.0647341 0.1094646 -0.0262382 0.0787088 -0.0023765 -0.0434158 0.0466764 -0.0325268 0.1325006 -0.0701229 0.1405803 -0.0253203 0.0831677 -0.0289729 -0.010821 -0.0689677 -0.0418857 -0.0379096 -0.0520658 -0.1185597 -0.0250899 -0.0688422 0.017818 0.0005848 -0.1133679 0.0008505 -0.1069638 -0.0191478 0.0227575 0.0000368 0.0200184 0.1365351 0.0547317 0.0921061 -0.0311062 0.0739663 -0.0763172 0.0439583 -0.0293278 0.0466398 0.1334215 0.0440915 -0.0561261 0.0345193 -0.1360467 0.1790823 -0.0191827 0.1356146 -0.0833207 -0.0534852 0.040848 0.0713167 -0.0182537 0.0873296 -0.0973231 0.0468553 -0.0266865 0.048135 0.1461916 -0.0164088 -0.1039314 0.0088234 -0.1190321 -0.0471806 0.0295341 0.0064316 0.0296071 0.1512378 -0.1403259 0.0281255 -0.026389 0.0289957 0.0845348 0.0157292 -0.0286054 0.0162497 0.1585058 -0.1688005 0.0966736 -0.005425 0.1970105 0.008781 -0.0109347 0.0329733 -0.059379 0.0104804 0.002487 -0.048026 0.0996602 0.0006063 0.0572123 0.1205846 0.0297488 0.0589869 -0.1346258 0.0310377 -0.0639948 -0.0545032 -0.1102724 -0.1052249 -0.060394 -0.0722891 -0.0424987 0.0666672 unknown
polarizability: 145.4540665|2.2193029|103.7259781|4.4193113|-2.9042458|67.5710949 unknown
InChI: InChI=1S/C9H13NO/c1-11-10-8-7-9-5-3-2-4-6-9/h2-6,10H,7-8H2,1H3
charge 0 multiplicity 1
24 atoms
O  3.547837 0.645437 -0.524076
N  2.930167 -0.686168 -0.886826
C  0.801561 -0.311522 0.378593
C  -0.701501 -0.10792 0.266734
C  1.46513 -0.450019 -1.012602
C  -1.241347 1.177416 -0.002142
C  -1.595785 -1.20295 0.386712
C  -2.634383 1.364059 -0.14698
C  -2.99048 -1.021902 0.243051
C  -3.514969 0.263562 -0.025503
C  4.487244 0.428483 0.582991
H  1.274976 0.546685 0.890611
H  1.033671 -1.220429 0.963637
H  1.238756 0.44941 -1.626084
H  1.054579 -1.334183 -1.540848
H  -0.563727 2.036177 -0.089832
H  -1.194988 -2.201935 0.600615
H  3.326185 -0.871117 -1.830637
H  -3.033508 2.364663 -0.349568
H  -3.666107 -1.879093 0.344514
H  -4.59598 0.407112 -0.134082
H  5.330039 -0.222808 0.279793
H  3.980724 -0.019057 1.458314
H  4.863807 1.436399 0.831015
