program: Gaussian 09
title: 000121186
version: EM64L-G09RevD.01
frameworkgroup: C1[X(C11H10O2S)]
method: RPBEPBE
basis: SDD
operation: Freq
keyword: #p
keyword: freq=noraman
keyword: PBEPBE/SDD
title: #p freq=noraman PBEPBE/SDD
converged: YES YES NO NO
title: Mulliken charges:
elementType: S O O C C C C C C C C C C C H H H H H H H H H H
charge: 0.270102 -0.418702 -0.214332 0.437139 0.500766 -0.423308 -0.593442 -0.623070 0.468102 -0.739828 -0.269189 -0.370184 -0.820710 0.211153 0.273313 0.250472 0.244618 0.275768 0.242213 0.232979 0.230258 0.229280 0.227458 0.379144
chargesum: 0.00000
title: Mulliken charges with hydrogens summed into heavy atoms:
elementType: S O O C C C C C C C C C C C
charge: 0.270102 -0.039558 -0.214332 0.437139 0.500766 -0.423308 -0.320128 -0.127980 0.468102 -0.464060 -0.026976 -0.137205 -0.133713 0.211153
polarizability: 1.64906958e+02 1.79302126e+01 1.72744652e+02 1.03770021e+01 -4.59568150e+00 7.67426975e+01
1716.lowfreq: -10.8582 -0.0027 -0.0020 0.0006 3.0246 7.9449 23.0073 52.9603 64.9919
frequency: 22.9671 52.9230 64.9915 75.1062 118.1274 166.2853 184.4437 260.7670 301.5858 310.5460 359.0331 397.9116 426.6804 458.8240 485.9176 501.5881 529.1544 548.6177 609.2871 626.5879 651.5151 702.3496 724.4063 755.6070 779.9310 799.4094 812.8805 856.1516 889.4951 902.2373 930.5418 955.1587 996.0777 1021.7333 1049.0761 1052.0687 1087.8774 1154.3206 1170.2373 1186.1774 1219.1364 1272.7223 1276.5856 1315.7153 1341.3180 1386.0455 1398.0714 1437.4037 1448.2798 1454.6409 1470.8939 1480.4242 1542.2462 1574.2485 1614.3609 1672.6097 2976.2090 3026.8411 3053.7281 3085.3419 3094.1001 3125.4232 3140.4926 3154.7771 3223.9830 3506.2606
redmass: 8.9805 6.3124 1.0504 5.6007 4.2248 3.9225 4.4214 5.1832 3.7004 4.9769 5.5848 2.6121 3.0755 3.9950 3.8887 3.5656 6.7275 4.2906 2.6362 5.0572 1.6877 4.8487 4.0734 4.8103 1.5695 3.8331 1.3488 4.7181 3.4819 1.4621 2.1237 1.3432 1.5401 4.5327 1.6223 1.9802 2.6282 1.3532 1.2954 1.4114 2.0797 1.4169 1.5480 1.8271 2.4581 6.5438 1.2522 3.1835 1.8699 1.4181 1.0457 1.2222 6.0184 7.0994 6.3084 8.6840 1.0373 1.0589 1.0976 1.0987 1.1036 1.0882 1.0919 1.0964 1.0961 1.0639
irintensity: 1.5867 0.3723 0.5726 0.1238 1.2047 1.2319 1.9492 0.1170 0.5700 0.1561 3.7304 2.4143 6.6463 3.9833 5.7346 7.4207 2.0646 39.8605 37.3226 4.7739 142.8948 6.5645 10.2985 6.3275 29.7928 16.2982 33.3353 8.0940 2.1767 10.9600 16.7876 0.8727 3.9333 34.2098 29.2103 152.0501 31.9201 7.5818 7.6709 6.5405 0.6372 2.0778 4.1416 33.0544 18.9873 0.3328 11.7739 7.9015 29.1668 22.3939 12.6750 14.0772 2.5549 1.5253 4.9163 238.6649 40.6140 13.3180 21.4502 17.7910 4.1011 9.4327 4.0942 14.6985 1.3653 20.5780
temp: 298.150 k
press: 1.00000 atm
elementType: 16 8 8 6 6 6 6 6 6 6 6 6 6 6 1 1 1 1 1 1 1 1 1 1
symmnumber: 1
zpe: 474142.6 jmol-1
zpe.correction: 0.180591 hartree
zpe.thermalcorrener: 0.193564 hartree
zpe.thermalcorrenthalpy: 0.194508 hartree
zpe.thermalcorrgfe: 0.139307 hartree
zpe.sumelectzpe: -972.695305 hartree
zpe.sumelectthermal: -972.682333 hartree
zpe.sumelectthermalent: -972.681389 hartree
zpe.sumelectthermalfe: -972.736590 hartree
dipole: -0.9696 -1.9718 1.0401
dipole: 2.4310
quadrupole: -85.0324 -80.6292 -91.9266
quadrupole: -0.4081 7.3484 3.0174
quadrupole: 0.8303 5.2336 -6.0639 -0.4081 7.3484 3.0174
hfenergy: -972.8758968 hartree
pointgroup: C01 [X(C11H10O2S1)]
dipole: -0.3706047 0.7821722 -0.406932 debye
dipolederiv: -0.2686991 -0.127174 0.060376 0.0473704 -0.3128927 0.0173644 0.0883664 0.0825373 0.0860651 -0.4663109 0.0970838 0.0381071 0.0812476 -1.1316143 0.1016318 0.0139417 -0.0352156 -0.2683554 -0.6478307 0.1507877 -0.238705 0.0351442 -0.5682839 -0.0192265 -0.4873249 0.0679418 -0.6542415 0.0024489 -0.2403561 0.0389132 -0.0841406 -0.1384193 0.020701 0.0132913 0.0694228 0.0354559 0.2457415 0.1547374 -0.013501 0.031885 -0.1395138 0.043439 -0.0956875 -0.0442787 -0.1030615 -0.0558482 -0.2653555 0.0121819 -0.2905651 0.4084374 -0.0099075 0.0130028 -0.0042221 -0.1311909 -0.0172937 0.1413491 -0.0446789 0.052671 -0.1082982 -0.0029622 -0.0306204 -0.0195538 -0.1627447 -0.0310563 -0.0855172 -0.1139035 -0.1674259 -0.0970963 -0.1308249 -0.0843647 -0.0868204 0.0031417 -0.000602 -0.1840008 0.015683 -0.1837149 0.3468302 -0.0159911 0.0150676 -0.0077735 -0.0342378 0.0944996 0.3793301 -0.1294329 0.2765678 0.1477265 -0.1024377 -0.1050154 -0.1661761 -0.2411176 0.0774332 0.0803879 -0.0525845 0.1024768 -0.093871 -0.0255272 -0.053417 -0.0187787 -0.0932535 0.0256117 0.0363147 -0.0555858 0.0749161 -0.1019495 -0.0240416 -0.058142 -0.0192589 -0.17983 0.0139502 0.1194161 -0.0044197 0.0675529 -0.0805755 0.004058 0.0012301 -0.0005093 0.0733583 0.68986 -0.2564771 0.4432694 -0.109767 1.3780566 0.067747 0.7694861 0.1597955 0.7870118 0.070553 -0.0639367 0.0406528 -0.0589397 -0.0028948 0.0234734 0.0443022 0.0254916 0.140551 0.0718344 0.0107434 -0.0513483 -0.0415327 -0.0054182 0.104354 -0.0210259 0.0564948 0.0133896 -0.0223838 0.0305156 0.0430016 0.1041172 0.0305351 -0.061715 -0.0072724 -0.0226675 0.0789808 -0.0011621 0.0427808 0.0429093 0.0162324 0.086736 0.0144438 0.0372146 0.0077704 0.1839481 0.023058 -0.0522483 0.0356755 -0.0982016 -0.0068062 0.0415529 0.0425903 0.0324486 0.1479534 -0.1064864 0.0552673 0.0477639 0.0741977 0.0676011 -0.0056658 0.049795 -0.0025663 0.1454468 -0.0330239 0.0689284 -0.1250534 0.0322722 0.0195822 -0.0000944 -0.1325066 0.0623098 -0.0057117 0.0577028 0.0584462 0.0852272 0.0524202 -0.0002343 -0.0253325 0.1005174 -0.101272 -0.074362 -0.0344755 -0.1611361 0.0479135 -0.0429976 -0.0159281 0.0213114 0.0341379 0.0432393 0.0930041 0.3124793 0.0101135 -0.1224613 0.0282136 0.3182908 -0.0363503 -0.1475667 -0.078359 0.1598 unknown
polarizability: 165.4283382|-17.6722777|172.8624082|-8.2383225|-3.5350498|76.1035608 unknown
InChI: InChI=1S/C11H10O2S/c1-7-2-3-10-9(4-7)8(6-14-10)5-11(12)13/h2-4,6,12H,5H2,1H3
charge 0 multiplicity 1
24 atoms
S  -0.481909 -3.000911 0.086282
O  2.431384 2.080187 0.252358
O  3.53088 0.257607 1.184119
C  -0.297625 -0.341699 -0.277569
C  1.037618 -0.883064 -0.520496
C  -1.247931 -1.354344 0.058742
C  -0.73378 1.011228 -0.340742
C  2.23647 -0.035081 -0.912162
C  -2.08061 1.342171 -0.086384
C  1.095473 -2.251949 -0.365268
C  -2.598005 -1.047041 0.319873
C  -3.001331 0.30051 0.242816
C  -2.560381 2.782174 -0.15413
C  2.813115 0.726688 0.27825
H  -0.01053 1.800246 -0.574915
H  1.958547 0.687348 -1.698224
H  3.040344 -0.684065 -1.298443
H  1.963125 -2.900983 -0.476353
H  -3.318959 -1.830059 0.575827
H  -4.048655 0.557964 0.442631
H  -3.343443 2.909055 -0.925563
H  -2.998422 3.106103 0.808787
H  -1.734672 3.472251 -0.397459
H  2.798198 2.540463 1.056122
