program: Gaussian 09
title: 000121184
version: EM64L-G09RevD.01
frameworkgroup: C1[X(C16H23NO3)]
method: RPBEPBE
basis: SDD
operation: Freq
keyword: #p
keyword: freq=noraman
keyword: PBEPBE/SDD
title: #p freq=noraman PBEPBE/SDD
converged: YES YES NO NO
title: Mulliken charges:
elementType: O O O N C C C C C C C C C C C C C C C C H H H H H H H H H H H H H H H H H H H H H H H
charge: -0.247254 -0.309179 -0.292041 -0.123783 -0.358177 -0.373216 0.061709 -0.244270 0.503597 0.091140 -0.306677 -0.297439 -0.055490 0.347772 -0.421452 -0.479367 -0.695997 -0.701515 -0.826416 -0.530814 0.243957 0.227631 0.226251 0.260784 0.246154 0.216951 0.230071 0.201569 0.221773 0.233307 0.232910 0.212745 0.215065 0.219001 0.226793 0.214649 0.207251 0.228397 0.262785 0.224774 0.262865 0.216800 0.226387
chargesum: 0.00000
title: Mulliken charges with hydrogens summed into heavy atoms:
elementType: O O O N C C C C C C C C C C C C C C C C
charge: -0.247254 -0.309179 -0.292041 -0.123783 0.113410 0.113819 0.061709 0.001884 0.503597 0.091140 0.140345 0.125903 -0.055490 0.347772 -0.188145 -0.246457 -0.049186 -0.052821 -0.110460 0.175238
polarizability: 2.24169452e+02 -4.66296060e+00 1.88176767e+02 -1.02842003e+01 -5.65572111e+00 1.52294955e+02
1716.lowfreq: -12.1053 -5.5179 -0.0008 -0.0005 0.0002 15.0388 22.2920 38.3462 44.5258
frequency: 20.9645 37.8919 43.6942 63.0875 70.9640 80.2254 91.5311 101.8513 111.7933 141.8658 165.2050 181.9002 186.9594 197.7017 214.8814 229.3076 245.6530 256.3421 269.0312 290.0172 321.3450 347.9104 376.9525 401.5991 408.8757 418.6375 459.1246 463.9763 473.7189 514.6132 570.2055 574.6019 607.5937 639.8196 659.0044 677.9298 721.5555 773.3833 792.9461 796.8526 832.0248 833.5036 871.3427 880.5113 906.8980 920.7295 935.4452 954.1957 958.4217 971.6768 1002.9903 1011.2867 1039.2359 1045.8931 1048.2028 1062.4743 1068.5478 1100.0390 1114.1057 1118.0545 1141.2225 1153.5545 1166.0229 1176.2350 1178.7198 1192.1963 1229.6929 1258.2629 1260.0981 1266.0889 1273.7799 1305.8521 1323.3821 1329.7561 1339.9758 1348.3966 1362.7035 1364.6680 1377.8588 1391.1556 1398.0919 1400.4892 1425.2151 1438.9707 1444.8181 1448.4520 1453.7381 1457.0934 1459.8262 1464.7319 1466.0219 1467.6121 1472.6211 1477.4053 1477.8569 1479.1859 1488.5847 1551.4079 1575.9053 1605.7196 2957.5401 2963.9244 2972.5249 2974.0795 2975.8102 2978.1952 2986.1509 2993.7446 3015.7833 3057.1322 3061.3753 3065.7709 3071.6305 3075.1086 3080.7242 3082.9322 3085.5509 3087.6900 3089.3807 3091.6473 3115.2032 3117.7105 3142.2632
redmass: 5.0512 3.7915 3.5302 3.2971 3.7064 1.5482 2.1362 2.1789 3.3552 5.1209 1.1189 2.4335 2.7753 1.4582 1.6970 2.5323 1.3987 3.0940 3.2721 3.1903 2.9858 3.4961 3.9542 2.1785 2.9765 3.3857 3.0095 5.1579 3.9104 4.2327 3.3145 3.8556 3.1511 3.0712 4.1893 4.4423 6.7657 5.2258 4.2766 4.7288 1.6649 1.4433 3.3697 4.4075 2.4796 1.2068 3.0555 1.4559 1.3235 2.5866 2.5507 2.3221 2.2103 2.3939 1.5839 1.5296 2.9381 2.3009 2.5537 1.2691 2.3684 1.4123 1.9503 1.4387 2.2759 1.1836 2.3157 1.9272 1.7414 1.8300 1.3906 2.0269 1.2450 1.3171 1.2209 1.3539 1.4960 3.3531 1.1977 2.3681 1.2190 1.2395 2.2766 1.2913 1.0848 1.0847 1.2750 1.0945 1.0663 1.0518 1.0554 1.0533 2.1109 1.0765 1.1121 1.0660 1.2364 7.3341 5.9157 7.6176 1.0674 1.0312 1.0349 1.0669 1.0354 1.0374 1.0643 1.0633 1.0845 1.0968 1.1035 1.1000 1.1002 1.0987 1.0996 1.0954 1.1001 1.1000 1.0995 1.0977 1.1027 1.0866 1.0963
irintensity: 1.1585 0.7455 0.2566 0.3073 1.5058 1.0470 3.0090 3.9605 4.2432 1.3514 0.4460 1.8400 2.9570 2.5813 2.1791 0.7390 3.0921 5.9423 4.8453 10.9631 7.4410 4.0054 4.3955 1.1418 1.3416 1.7390 0.6427 13.1596 0.9345 4.0277 25.8279 3.7991 2.7689 2.2783 8.0377 4.1286 4.9698 7.4606 16.7903 1.2188 0.3522 30.3043 0.9470 8.9255 8.9731 1.6118 22.0924 0.0577 0.0586 39.8856 15.4752 54.2357 21.3673 49.3063 15.1417 27.6432 21.9748 8.5372 1.5531 1.8284 5.9921 1.7666 8.3443 6.7218 0.0276 2.5539 117.2692 48.6775 2.5300 9.7943 40.9348 22.5964 0.4895 1.1472 6.0734 4.6261 2.0881 1.9227 16.9547 20.4069 14.1799 11.9182 68.6512 31.7974 20.8935 3.7652 48.0329 5.6201 8.2108 22.8455 0.5007 6.4727 23.3895 23.8458 22.0107 1.3958 31.0859 236.3658 8.4715 5.2139 44.4222 66.8595 35.8425 20.9970 41.6901 20.0076 32.8167 61.1486 1.1286 14.1802 28.0709 1.2685 37.3219 83.6418 40.0373 32.1657 17.7518 33.5567 20.0401 12.8951 22.9460 11.9127 27.2661
temp: 298.150 k
press: 1.00000 atm
elementType: 8 8 8 7 6 6 6 6 6 6 6 6 6 6 6 6 6 6 6 6 1 1 1 1 1 1 1 1 1 1 1 1 1 1 1 1 1 1 1 1 1 1 1
symmnumber: 1
zpe: 948712.4 jmol-1
zpe.correction: 0.361345 hartree
zpe.thermalcorrener: 0.382690 hartree
zpe.thermalcorrenthalpy: 0.383634 hartree
zpe.thermalcorrgfe: 0.310311 hartree
zpe.sumelectzpe: -902.375427 hartree
zpe.sumelectthermal: -902.354083 hartree
zpe.sumelectthermalent: -902.353139 hartree
zpe.sumelectthermalfe: -902.426461 hartree
dipole: 1.5970 -0.1754 -1.2361
dipole: 2.0271
quadrupole: -116.0734 -119.1983 -122.1857
quadrupole: -4.0678 -1.5383 -10.5309
quadrupole: 3.0791 -0.0458 -3.0332 -4.0678 -1.5383 -10.5309
hfenergy: -902.7367725 hartree
pointgroup: C01 [X(C16H23N1O3)]
dipole: 0.6002217 0.0644151 0.5211775 debye
polarizability: 222.8008791|4.8449837|188.2678878|14.2655046|-5.0848811|153.5724078 unknown
InChI: InChI=1S/C16H23NO3/c1-11(2)13-6-5-12(3)14(15(13)19-4)16(18)17-7-9-20-10-8-17/h5-6,11H,7-10H2,1-4H3
charge 0 multiplicity 1
43 atoms
O  -3.891462 1.813042 0.837825
O  0.455769 1.402372 -0.646501
O  -1.426871 -1.236117 -2.0043
N  -2.256413 -0.394883 0.003036
C  -2.098146 0.172789 1.358714
C  -3.614664 -0.22566 -0.559951
C  0.151631 -0.970278 -0.179972
C  3.228595 1.357514 0.312356
C  2.330127 0.119338 0.308826
C  -1.229019 -0.868127 -0.796946
C  -2.513656 1.660246 1.342294
C  -3.999727 1.26711 -0.527786
C  0.999647 0.166504 -0.184488
C  0.632369 -2.219501 0.299494
C  2.786131 -1.130248 0.798389
C  1.959702 -2.273709 0.790871
C  4.430206 1.184041 -0.65601
C  3.721298 1.700633 1.743176
C  -0.248727 -3.455598 0.272229
C  0.590407 1.604912 -2.109481
H  -1.05361 0.066657 1.691618
H  -2.754069 -0.383329 2.05812
H  -4.332237 -0.808514 0.049834
H  -3.606978 -0.617809 -1.590815
H  2.616463 2.207452 -0.042255
H  -2.528254 2.079344 2.361824
H  -1.804908 2.230468 0.706912
H  -3.340289 1.839048 -1.215371
H  -5.053046 1.412207 -0.818714
H  3.80737 -1.210997 1.189633
H  2.347474 -3.226572 1.169369
H  5.0855 0.353361 -0.333122
H  5.041359 2.105447 -0.685329
H  4.090949 0.96127 -1.684259
H  2.870564 1.856587 2.430466
H  4.328917 2.624466 1.729614
H  4.350229 0.891265 2.158948
H  -1.179512 -3.306453 0.851879
H  -0.552625 -3.695318 -0.763257
H  0.277946 -4.328892 0.692289
H  0.086454 0.790639 -2.661871
H  1.65868 1.6491 -2.398079
H  0.105926 2.570794 -2.321007
