program: Gaussian 09
title: 000121150
version: EM64L-G09RevD.01
frameworkgroup: C1[X(C11H13N3O4)]
method: RPBEPBE
basis: SDD
operation: Freq
keyword: #p
keyword: freq=noraman
keyword: PBEPBE/SDD
title: #p freq=noraman PBEPBE/SDD
converged: YES YES NO NO
title: Mulliken charges:
elementType: O O O O N N N C C C C C C C C C C C H H H H H H H H H H H H H
charge: -0.271055 -0.285058 -0.264071 -0.282021 -0.106220 -0.153263 -0.604017 0.289134 0.088124 0.077944 0.251087 -0.381504 -0.352354 0.081176 0.188018 -0.514440 -0.518461 -0.535007 0.252714 0.242304 0.226528 0.247578 0.235877 0.246302 0.224121 0.229822 0.227923 0.221944 0.246793 0.348436 0.341643
chargesum: 0.00000
title: Mulliken charges with hydrogens summed into heavy atoms:
elementType: O O O O N N N C C C C C C C C C C C
charge: -0.271055 -0.285058 -0.264071 -0.282021 -0.106220 -0.153263 0.086062 0.289134 0.088124 0.077944 0.251087 -0.128790 -0.110050 0.081176 0.188018 0.195543 0.181785 0.161654
polarizability: 2.63753565e+02 -5.39379506e+00 1.68039764e+02 -8.17518331e-01 -2.34343528e+00 8.28004701e+01
1716.lowfreq: -8.4264 0.0006 0.0009 0.0009 1.9747 7.5555 36.1595 50.7229 68.5857
frequency: 36.1567 50.6871 68.5801 74.1329 84.5077 96.8582 114.1606 147.7741 151.7215 159.0963 181.2225 206.1661 230.3916 237.2168 261.9321 274.6695 289.3559 316.8195 320.7258 368.4376 376.7527 382.4822 432.2575 440.2396 489.7806 563.7159 577.6773 629.3300 636.6897 652.2717 658.0407 688.0080 708.2610 787.7904 799.3091 804.5327 859.0605 865.1461 878.5249 933.0744 938.3857 948.7464 964.4959 1037.7136 1050.4343 1094.7269 1108.9271 1110.6946 1112.4451 1146.8424 1153.1855 1156.7915 1188.5953 1203.0325 1234.1801 1260.5354 1331.7997 1367.6935 1395.4674 1421.6440 1435.3180 1445.0687 1451.6741 1460.8138 1462.8738 1467.9672 1471.0911 1474.7335 1477.7049 1530.0166 1560.0918 1573.8002 1602.0015 1638.6597 2965.4359 2979.2713 2983.0017 3056.2424 3081.1743 3088.6742 3124.3246 3126.1770 3128.6652 3154.3622 3175.1172 3581.0875 3729.0441
redmass: 5.9757 4.7751 3.3475 2.8451 3.0705 3.9979 3.7050 2.7731 1.1630 1.2445 3.8666 3.5637 2.3869 2.4221 2.2610 2.7563 4.6588 7.7390 1.7921 4.5081 4.0150 3.8439 1.3353 4.0553 5.6894 6.6004 4.7001 6.4998 6.0509 6.4385 6.1557 8.1177 7.5283 6.8900 1.8577 4.0607 11.5049 7.2349 12.2644 1.5291 2.9731 8.9422 9.4215 3.8732 4.9134 3.1476 1.2687 1.2472 1.2581 1.4758 1.3682 1.3547 1.7245 4.9672 2.1824 3.6776 3.9528 9.8698 1.9850 1.3741 1.2568 1.7501 1.7449 1.1218 1.0892 1.0500 1.0628 1.0809 1.0534 8.4766 5.8373 1.6389 6.3713 3.0636 1.0326 1.0307 1.0289 1.1041 1.1035 1.1064 1.1030 1.1027 1.1000 1.0871 1.0962 1.0447 1.1058
irintensity: 7.6249 1.3726 2.5814 12.7620 4.8286 4.1446 4.3254 3.4742 1.0043 1.6810 1.1490 2.0936 4.9796 3.8130 11.2603 8.0757 20.1192 0.4206 52.8387 11.0480 10.3745 36.0172 218.3725 13.5551 1.7478 9.6583 3.4146 6.7534 2.2859 0.5937 22.6920 18.2520 0.8604 16.0587 59.2493 16.7325 29.3351 3.4372 6.4262 10.0110 43.7895 51.0411 24.8417 100.1807 110.3563 110.4801 2.4778 9.2881 0.1331 2.4500 2.6745 13.4823 22.9963 47.9687 19.8111 215.9007 6.6322 1.4143 85.8669 73.3640 38.4359 72.2151 142.2903 10.5826 24.2790 14.1693 11.7937 20.0200 13.6618 19.6205 3.6463 50.0135 138.7644 597.9714 75.0437 76.6681 57.1501 42.9326 31.2750 16.6073 21.6056 24.5008 22.3046 5.2659 8.7158 173.3685 61.7910
temp: 298.150 k
press: 1.00000 atm
elementType: 8 8 8 8 7 7 7 6 6 6 6 6 6 6 6 6 6 6 1 1 1 1 1 1 1 1 1 1 1 1 1
symmnumber: 1
zpe: 611795.9 jmol-1
zpe.correction: 0.233021 hartree
zpe.thermalcorrener: 0.251474 hartree
zpe.thermalcorrenthalpy: 0.252418 hartree
zpe.thermalcorrgfe: 0.186167 hartree
zpe.sumelectzpe: -890.690311 hartree
zpe.sumelectthermal: -890.671857 hartree
zpe.sumelectthermalent: -890.670913 hartree
zpe.sumelectthermalfe: -890.737165 hartree
dipole: 1.1977 -5.9978 1.1394
dipole: 6.2214
quadrupole: -75.3333 -91.4724 -106.0568
quadrupole: 10.2484 -2.7947 -0.2045
quadrupole: 15.6209 -0.5182 -15.1026 10.2484 -2.7947 -0.2045
hfenergy: -890.9233318 hartree
pointgroup: C01 [X(C11H13N3O4)]
dipole: -0.5751776 -2.3225692 -0.5158524 debye
polarizability: 264.0139135|0.685872|167.5758426|2.6700466|4.463713|83.0040432 unknown
InChI: InChI=1S/C11H13N3O4/c1-15-7-5-4-6(8(16-2)9(7)17-3)10-13-14-11(12)18-10/h4-5H,12H2,1-3H3
charge 0 multiplicity 1
31 atoms
O  0.085793 2.040396 -0.314318
O  -2.63337 1.649664 0.014645
O  -3.695945 -0.925261 0.071457
O  2.805577 -1.245429 -0.343703
N  2.68494 0.886969 0.491298
N  4.079521 0.528617 0.373602
N  5.163423 -1.516924 -0.397903
C  0.515383 -0.352642 0.007178
C  -0.392289 0.750579 -0.07189
C  -1.793465 0.526085 -0.030195
C  -2.300121 -0.806795 0.033874
C  -0.013327 -1.668319 0.048434
C  -1.400902 -1.900537 0.053856
C  1.956067 -0.1433 0.064654
C  4.089756 -0.720307 -0.113378
C  0.123201 2.960466 0.84503
C  -3.531898 1.835562 -1.146437
C  -4.257555 -2.273532 0.204075
H  0.677821 -2.51507 0.090692
H  -1.771662 -2.928304 0.094782
H  0.444247 3.928147 0.431722
H  0.870763 2.602194 1.574624
H  -0.882168 3.048261 1.294398
H  -4.231623 0.986764 -1.235765
H  -2.9381 1.950004 -2.072565
H  -4.083341 2.764551 -0.936872
H  -3.904726 -2.761875 1.132355
H  -4.00362 -2.903838 -0.670015
H  -5.346099 -2.12525 0.252186
H  6.096026 -1.149085 -0.236066
H  5.034592 -2.438291 -0.803257
