program: Gaussian 09
title: 000014516
version: EM64L-G09RevD.01
frameworkgroup: C1[X(C7H8OS)]
method: RPBEPBE
basis: SDD
operation: Freq
keyword: #pfreq=noraman
keyword: PBEPBE/SDD
title: #p freq=noraman PBEPBE/SDD
converged: NO YES NO NO
title: Mulliken charges:
elementType: S O C C C C C C C H H H H H H H H
charge: 0.649156 -0.622109 -0.145390 -0.245257 -0.254459 -0.210394 -0.209016 -0.225348 -0.800714 0.310266 0.243103 0.237322 0.233891 0.233195 0.246278 0.288844 0.270631
chargesum: 0.00000
title: Mulliken charges with hydrogens summed into heavy atoms:
elementType: S O C C C C C C C
charge: 0.649156 -0.622109 -0.145390 0.065009 -0.011355 0.026928 0.024876 0.007847 0.005038
polarizability: 1.28510677e+02 9.42179480e-01 1.00501595e+02 1.97733495e-01 2.91735422e+00 5.52114057e+01
1716.lowfreq: 0.0006 0.0017 0.0023 2.7757 10.6543 12.1776 63.2935 113.9291 151.9517
frequency: 63.2541 113.9233 151.9485 180.4601 226.8199 272.5626 304.3483 401.1830 406.9314 482.0627 546.9885 606.1104 650.4299 700.2394 754.3274 791.7023 856.3164 930.5714 952.0013 958.5562 979.2339 986.1629 1007.0541 1009.8831 1044.2958 1073.1465 1169.7386 1174.7393 1297.6668 1301.3126 1383.4939 1414.2504 1429.8586 1431.3144 1453.9676 1582.0968 1601.3932 3016.8205 3113.2284 3124.2107 3135.7588 3149.8448 3159.2603 3166.0843 3168.3644
redmass: 4.0207 3.5468 1.3413 2.4848 4.2785 5.0022 6.5002 5.7198 3.3638 3.4399 6.8318 6.4801 6.7933 2.3313 1.4481 12.8795 1.2444 1.3328 1.2641 1.3201 5.8058 1.3628 1.3613 3.7048 2.0846 1.5623 1.0778 1.1084 1.2881 1.1599 8.8639 1.0541 1.1435 1.9037 2.0509 5.8465 6.8060 1.0254 1.0894 1.0871 1.0897 1.0955 1.1059 1.1011 1.1071
irintensity: 3.3561 1.7560 3.1160 6.4967 1.3044 5.3518 3.3852 8.7381 2.7265 15.3088 19.8448 0.0814 0.3494 36.4302 71.1260 40.3766 0.6895 5.9958 25.4094 9.0866 1.3025 1.1753 1.3468 5.3495 9.9216 8.8018 1.2505 1.5563 3.4499 5.1399 1.6362 12.3868 6.5250 24.2948 19.2671 8.0653 2.3429 7.9649 8.9463 1.8993 0.8353 24.3599 6.5957 32.3095 5.0323
temp: 298.150 k
press: 1.00000 atm
elementType: 16 8 6 6 6 6 6 6 6 1 1 1 1 1 1 1 1
symmnumber: 1
zpe: 339284.4 jmol-1
zpe.correction: 0.129227 hartree
zpe.thermalcorrener: 0.138323 hartree
zpe.thermalcorrenthalpy: 0.139267 hartree
zpe.thermalcorrgfe: 0.094795 hartree
zpe.sumelectzpe: -744.078346 hartree
zpe.sumelectthermal: -744.069249 hartree
zpe.sumelectthermalent: -744.068305 hartree
zpe.sumelectthermalfe: -744.112778 hartree
dipole: -2.6103 -3.7162 1.2001
dipole: 4.6973
quadrupole: -58.4858 -58.5629 -62.7182
quadrupole: -9.0888 2.0378 2.3534
quadrupole: 1.4365 1.3594 -2.7959 -9.0888 2.0378 2.3534
hfenergy: -744.2075723 hartree
pointgroup: C01 [X(C7H8O1S1)]
dipole: -1.0481817 -1.4250781 0.5345411 debye
dipolederiv: 0.72985 0.0863394 -0.1346602 0.2345731 0.5014607 -0.3384707 -0.0845199 -0.1636002 0.5422539 -0.6073372 -0.0134324 0.1080999 -0.2025268 -0.4992287 0.2869577 -0.0331257 -0.0917264 -0.4406778 0.1943572 -0.0749522 0.0031545 -0.1485596 -0.075541 0.0135127 0.0983139 0.0487471 -0.1544255 -0.3006201 0.1105214 0.0124158 -0.0339237 -0.0866885 0.0028323 -0.0154454 -0.0150546 -0.1200019 -0.2448766 -0.0863435 -0.0427005 0.1342115 0.0410446 0.0477233 0.0440562 0.0474235 -0.1096586 0.022184 -0.1088258 -0.0422241 -0.0120112 0.1370485 0.0518375 -0.0334139 0.0657032 -0.1244658 0.008572 0.1013621 -0.0000919 0.0203852 0.0410598 0.0321889 -0.0271975 0.024572 -0.1350246 0.1003697 -0.0075371 -0.0419587 -0.0245594 -0.0590361 0.0234531 -0.0278556 0.0174264 -0.1439365 -0.1115176 -0.0176528 0.0430959 0.0046491 -0.1096237 0.0449714 0.0191108 0.1317452 -0.1722809 0.1668107 -0.0739292 0.013106 -0.0209377 0.0909516 -0.0223201 0.0043511 -0.0082361 0.1592112 0.0773598 0.0902736 0.0339679 0.0507384 -0.0349319 -0.0490285 0.0269398 -0.0417326 0.1395261 0.0185581 0.0630364 0.0235696 0.0806103 -0.0655908 -0.0507435 0.0336019 -0.0501992 0.1467598 -0.0262534 -0.0976947 -0.0082431 -0.1005005 -0.033501 -0.0331343 -0.0016583 -0.0293793 0.1551141 -0.1223192 0.0205488 0.0316664 0.0205225 0.0940758 -0.0166733 0.0366286 -0.0148918 0.1542682 0.0841461 -0.0838837 -0.0167434 -0.0647743 -0.0684533 0.0334593 -0.0227919 0.0494986 0.0424049 0.1010343 0.0524923 0.0407242 0.0325144 0.0192933 -0.0487435 0.0364208 -0.0067758 -0.0180858 -0.0903177 0.0396775 -0.0231783 0.0295887 0.1076607 0.0221777 -0.0534147 0.03648 0.0790193 unknown
polarizability: 128.5162342|0.6438928|100.6633459|0.9414292|0.6137863|55.0440978 unknown
InChI: InChI=1S/C7H8OS/c1-9(8)7-5-3-2-4-6-7/h2-6H,1H3
charge 0 multiplicity 1
17 atoms
S  2.060529 -0.197176 -0.488981
O  2.566132 1.387363 -0.297709
C  0.166719 -0.104291 -0.201579
C  -0.333935 1.169224 0.108291
C  -0.654933 -1.235865 -0.355395
C  -1.72865 1.312049 0.29739
C  -2.049042 -1.079469 -0.162475
C  -2.581683 0.190593 0.164828
C  2.481176 -1.010722 1.214023
H  0.372417 2.006925 0.185086
H  -0.237976 -2.213788 -0.623866
H  -2.147459 2.294405 0.541459
H  -2.713834 -1.943036 -0.273642
H  -3.661698 0.30672 0.308063
H  2.012501 -2.004895 1.26653
H  2.089873 -0.327398 1.980782
H  3.578363 -1.072638 1.251296
