program: Gaussian 09
title: 000121029
version: EM64L-G09RevD.01
frameworkgroup: C1[X(C12H12N2O2)]
method: RPBEPBE
basis: SDD
operation: Freq
keyword: #p
keyword: freq=noraman
keyword: PBEPBE/SDD
title: #p freq=noraman PBEPBE/SDD
converged: YES YES NO NO
title: Mulliken charges:
elementType: O O N N C C C C C C C C C C C C H H H H H H H H H H H H
charge: -0.420889 -0.276250 -0.166402 -0.083352 -0.566060 0.460285 0.303389 0.223295 -0.473468 -0.371962 -0.392108 -0.767069 0.130429 -0.225551 -0.226558 -0.235585 0.257317 0.247508 0.283734 0.256172 0.262353 0.229521 0.242597 0.242612 0.225553 0.226540 0.228209 0.385738
chargesum: 0.00000
title: Mulliken charges with hydrogens summed into heavy atoms:
elementType: O O N N C C C C C C C C C C C C
charge: -0.035152 -0.276250 -0.166402 -0.083352 -0.061235 0.460285 0.303389 0.223295 -0.189734 -0.115790 -0.129754 -0.052339 0.130429 0.000002 -0.000018 -0.007376
polarizability: 1.66434587e+02 -1.20875742e+01 1.71529726e+02 2.52982575e+00 1.87517610e-02 9.60559199e+01
1716.lowfreq: -57.9552 -7.9175 -6.4786 -0.0007 -0.0004 0.0005 3.4771 25.0805 40.6993
frequency: -57.9206 24.8510 40.6945 46.8329 78.7022 144.9134 158.1219 176.1536 212.4470 250.2188 328.3354 342.0632 365.3136 392.6389 403.5977 462.2489 526.6158 545.7272 573.9537 611.6897 619.2559 635.7286 650.4740 671.8267 706.3672 732.9679 743.4801 798.1573 815.1868 857.5501 860.5295 921.3561 942.7506 981.4955 982.7954 990.0273 995.8847 998.9077 1008.8807 1026.9139 1049.3948 1082.2087 1117.5715 1134.6656 1172.6600 1189.0779 1195.3400 1210.8630 1268.2290 1298.5424 1323.9813 1339.3535 1358.2656 1387.6875 1401.9529 1416.8101 1441.6678 1443.8732 1460.4640 1464.5887 1483.8671 1485.5799 1524.2958 1595.4241 1613.7612 1645.7485 2992.4393 3044.1829 3074.2211 3102.6363 3115.1245 3122.4220 3130.1182 3141.2442 3150.8309 3164.2480 3247.5191 3526.6939
redmass: 1.0175 4.6035 4.7672 5.1155 9.1704 4.3644 5.4272 5.5596 3.8646 4.9221 4.0015 2.8830 2.8634 7.4021 2.8279 3.3373 4.0521 1.6976 2.7287 4.6197 5.2633 4.4257 3.7947 4.8286 1.7516 5.9076 2.3578 3.6148 3.2335 1.2454 1.4166 1.6944 1.7674 1.4013 1.7850 5.0992 5.1026 1.3737 3.2169 2.2464 1.4953 1.7232 1.9796 1.4513 1.0554 1.1876 2.2289 2.7167 2.4559 3.1895 1.4781 2.4586 1.4646 4.6085 1.2236 4.0671 2.2173 2.1199 1.6115 1.0442 1.6137 1.5988 6.4851 6.0888 5.9872 7.9658 1.0372 1.0602 1.0983 1.0990 1.1037 1.0847 1.0880 1.0927 1.0966 1.1016 1.0997 1.0642
irintensity: 0.1859 0.0946 0.3658 1.2348 0.5908 0.4422 0.5815 4.2619 1.7682 4.9577 0.5935 3.9613 3.0876 8.1224 0.0208 2.3304 18.4758 101.0861 16.0027 8.7734 6.7778 37.5415 5.3533 33.9389 75.8899 28.1808 40.9575 5.1570 2.2592 0.7565 23.8581 3.9955 3.3225 0.8559 21.8641 7.9450 256.0173 10.1236 44.8430 6.5294 7.7703 11.1299 15.2220 77.9486 0.0428 6.0540 23.5113 12.8513 34.6037 10.2416 5.5075 21.5289 3.0259 3.2720 8.8872 18.1719 92.9284 1.8244 66.4790 14.6359 9.3047 8.3216 92.5710 2.5615 3.2550 279.9687 29.0520 17.0236 16.0056 15.2152 0.1904 0.5081 3.7990 17.3626 24.8109 22.1143 0.4383 52.9592
temp: 298.150 k
press: 1.00000 atm
elementType: 8 8 7 7 6 6 6 6 6 6 6 6 6 6 6 6 1 1 1 1 1 1 1 1 1 1 1 1
symmnumber: 1
zpe: 571475.3 jmol-1
zpe.correction: 0.217663 hartree
zpe.thermalcorrener: 0.231254 hartree
zpe.thermalcorrenthalpy: 0.232198 hartree
zpe.thermalcorrgfe: 0.175440 hartree
zpe.sumelectzpe: -723.281527 hartree
zpe.sumelectthermal: -723.267937 hartree
zpe.sumelectthermalent: -723.266993 hartree
zpe.sumelectthermalfe: -723.323750 hartree
dipole: 0.7314 0.1188 -0.9573
dipole: 1.2106
quadrupole: -84.5323 -84.6684 -93.0990
quadrupole: 0.7224 0.7106 -0.8624
quadrupole: 2.9010 2.7648 -5.6658 0.7224 0.7106 -0.8624
hfenergy: -723.4991905 hartree
pointgroup: C01 [X(C12H12N2O2)]
dipole: 0.2797314 -0.0388551 0.3835086 debye
polarizability: 165.900246|11.9378279|172.1457953|-0.866616|0.1425018|95.9741916 unknown
InChI: InChI=1S/C12H12N2O2/c1-9-7-11(12(15)16)14(13-9)8-10-5-3-2-4-6-10/h2-7,15H,8H2,1H3
charge 0 multiplicity 1
28 atoms
O  2.406312 -2.64336 1.016142
O  0.612458 -2.706657 -0.462621
N  0.924316 0.279932 -0.683272
N  1.367812 1.582655 -0.579612
C  -0.302383 0.011097 -1.471872
C  -1.578607 0.115588 -0.640408
C  1.700812 -0.589475 0.08247
C  2.45901 1.535118 0.266651
C  2.696752 0.202999 0.697799
C  -2.045258 1.382846 -0.206627
C  -2.313746 -1.048161 -0.305156
C  3.214279 2.791339 0.601317
C  1.48421 -2.033313 0.150516
C  -3.233452 1.4840 0.549426
C  -3.505527 -0.945865 0.449212
C  -3.968236 0.319458 0.877111
H  -0.206976 -0.994794 -1.90747
H  -0.298504 0.765295 -2.276306
H  3.480552 -0.16127 1.356627
H  -1.469529 2.281649 -0.457565
H  -1.941014 -2.028178 -0.623825
H  4.052169 2.570532 1.282693
H  3.624618 3.264573 -0.308656
H  2.557871 3.532929 1.090726
H  -3.588544 2.466559 0.88039
H  -4.069094 -1.850729 0.703238
H  -4.892215 0.398969 1.46116
H  2.225214 -3.621737 1.027314
