program: Gaussian 09
title: 000120997
version: EM64L-G09RevD.01
frameworkgroup: C1[X(C14H16N2O)]
method: RPBEPBE
basis: SDD
operation: Freq
keyword: #p
keyword: freq=noraman
keyword: PBEPBE/SDD
title: #p freq=noraman PBEPBE/SDD
converged: NO YES NO NO
title: Mulliken charges:
elementType: O N N C C C C C C C C C C C C C C H H H H H H H H H H H H H H H H
charge: -0.258800 -0.155423 -0.281619 0.303199 0.027755 -0.479555 -0.491951 -0.411521 -0.414552 0.071316 -0.662922 0.442213 -0.360689 -0.386444 -0.216075 -0.215162 -0.253729 0.231086 0.227011 0.240961 0.224896 0.216397 0.209450 0.207508 0.211068 0.241627 0.239605 0.269981 0.285266 0.259024 0.226955 0.225040 0.228081
chargesum: 0.00000
title: Mulliken charges with hydrogens summed into heavy atoms:
elementType: O N N C C C C C C C C C C C C C C
charge: -0.258800 -0.155423 -0.281619 0.303199 0.027755 -0.021458 -0.026093 0.014326 0.004024 0.071316 0.088292 0.442213 -0.075422 -0.127420 0.010881 0.009878 -0.025648
polarizability: 2.38154450e+02 -4.04298162e-01 1.66906029e+02 -2.27270828e+00 9.48757760e+00 1.00769795e+02
1716.lowfreq: -3.2332 -0.0007 -0.0002 0.0004 5.6826 10.0104 44.6115 63.8653 92.1297
frequency: 44.5669 63.8482 92.1278 110.1337 128.0882 147.5263 193.8674 221.8098 254.1293 261.2744 270.1410 288.0422 318.7858 340.1007 407.6475 413.2524 460.3956 472.7890 503.6325 566.5389 581.3579 613.8681 617.0413 644.6422 678.9477 700.3679 706.6819 759.4653 779.3391 822.6055 841.6641 854.6262 870.9858 904.1332 910.5707 959.9013 969.6741 984.5611 986.1881 990.8255 1010.3698 1038.8196 1076.0746 1079.9161 1082.5651 1096.7712 1115.0109 1130.2219 1138.0189 1167.8874 1171.4741 1185.9236 1188.7918 1236.8485 1247.5427 1269.9687 1299.6416 1316.1962 1329.5186 1335.6407 1340.7884 1359.7196 1384.7273 1411.0883 1436.1176 1445.2600 1453.9949 1462.9797 1467.9534 1468.7078 1474.8629 1484.7611 1493.9102 1588.3115 1608.2445 1632.0419 1639.3802 2960.1997 2969.3968 2971.6320 2981.8909 2988.5790 3023.4059 3037.7601 3047.9857 3056.6027 3078.4566 3118.2117 3126.9121 3138.1897 3152.5435 3164.9631 3190.5062
redmass: 4.5961 3.8105 4.1965 2.9367 2.9935 3.8403 1.0952 3.0826 4.7917 3.4080 3.2551 2.5152 4.5185 2.9914 3.5366 3.5712 2.6351 4.0825 3.4205 3.4292 5.2551 6.2568 6.8226 4.8093 3.3197 2.0546 6.2569 1.7402 4.3310 1.5532 1.2552 2.4268 2.8264 1.4979 1.4217 2.3707 1.3661 3.3260 2.5467 2.2038 4.0118 1.9876 2.1021 1.9279 2.1818 1.9171 1.6951 1.2733 1.3494 1.5382 1.0515 1.1297 4.1988 1.2893 1.3873 1.9449 1.7020 1.7169 2.2268 1.4076 1.4760 1.9637 8.7182 2.7796 1.3999 2.1161 1.1097 1.0776 1.0772 1.1223 1.1034 2.3938 1.1061 6.4724 6.2843 11.1721 8.1134 1.0632 1.0425 1.0665 1.0631 1.0628 1.0943 1.0935 1.0991 1.1042 1.0918 1.1018 1.0849 1.0892 1.0939 1.0995 1.0959
irintensity: 1.5486 1.6788 1.0602 0.8707 3.3642 3.0975 0.3211 2.6802 6.1552 0.6539 1.4076 7.1682 1.2613 3.6099 2.0272 7.4206 1.3182 7.1604 9.7880 4.5063 11.8142 0.1127 16.9108 1.1742 12.0857 37.6470 4.7927 75.0360 4.6315 8.5942 0.8102 5.7883 3.3012 2.0909 4.3576 8.6324 0.9741 1.3341 20.9290 13.9028 5.0407 11.5023 4.8964 4.3640 6.9990 8.2070 53.3329 10.5987 11.7649 2.0500 0.2723 2.0003 22.5032 5.9793 3.1739 18.8106 63.8606 41.9132 73.8788 3.0575 0.9821 6.9198 1.2422 34.7628 13.8401 18.9079 11.3774 22.1423 24.1526 7.7007 11.1354 132.2586 4.3753 2.3635 84.6146 324.4916 1.6165 19.7048 80.3572 17.8796 37.9615 29.8115 29.4777 19.1737 66.9856 58.8342 16.1675 13.2078 2.0090 13.2261 29.4934 21.3233 1.8265
temp: 298.150 k
press: 1.00000 atm
elementType: 8 7 7 6 6 6 6 6 6 6 6 6 6 6 6 6 6 1 1 1 1 1 1 1 1 1 1 1 1 1 1 1 1
symmnumber: 1
zpe: 714250.9 jmol-1
zpe.correction: 0.272044 hartree
zpe.thermalcorrener: 0.286728 hartree
zpe.thermalcorrenthalpy: 0.287673 hartree
zpe.thermalcorrgfe: 0.230545 hartree
zpe.sumelectzpe: -726.567146 hartree
zpe.sumelectthermal: -726.552462 hartree
zpe.sumelectthermalent: -726.551518 hartree
zpe.sumelectthermalfe: -726.608645 hartree
dipole: -2.0851 -5.1641 0.8845
dipole: 5.6390
quadrupole: -84.7994 -102.5383 -100.3267
quadrupole: 0.8988 -0.0227 1.0402
quadrupole: 11.0887 -6.6501 -4.4386 0.8988 -0.0227 1.0402
hfenergy: -726.8391902 hartree
pointgroup: C01 [X(C14H16N2O1)]
dipole: 0.8083181 -2.0306431 -0.3808549 debye
polarizability: 238.1853045|-0.0136127|167.2456126|-1.2388939|-8.1843337|100.3993575 unknown
InChI: InChI=1S/C14H16N2O/c1-15-13-10-6-5-9-12(13)14(17)16(15)11-7-3-2-4-8-11/h2-4,7-8H,5-6,9-10H2,1H3
charge 0 multiplicity 1
33 atoms
O  0.048122 2.446414 -0.00462
N  0.449018 -1.103135 -0.192859
N  -0.354927 0.087068 -0.27227
C  1.778793 -0.656624 -0.03362
C  1.83253 0.717771 0.08022
C  2.969299 -1.578303 -0.00044
C  3.0989 1.492047 0.331571
C  4.183699 -0.818631 0.604927
C  4.332058 0.606309 0.01103
C  0.48074 1.257268 -0.063924
C  0.140014 -2.159674 -1.188205
C  -1.764595 0.014499 -0.072498
C  -2.582797 1.068269 -0.557988
C  -2.349738 -1.080344 0.617657
C  -3.977426 1.012678 -0.355072
C  -3.748696 -1.12961 0.795143
C  -4.570699 -0.086411 0.309891
H  2.749048 -2.485187 0.595192
H  3.21946 -1.922279 -1.025851
H  3.105689 2.414053 -0.278735
H  3.13571 1.826509 1.388527
H  4.051419 -0.740537 1.701972
H  5.104789 -1.404623 0.428535
H  4.455288 0.529741 -1.088045
H  5.248871 1.081382 0.407243
H  0.784291 -3.028032 -0.976503
H  0.318365 -1.810028 -2.224467
H  -0.911336 -2.469927 -1.090179
H  -2.118509 1.9190 -1.06138
H  -1.706577 -1.858934 1.04094
H  -4.603962 1.831743 -0.724968
H  -4.193943 -1.976551 1.329315
H  -5.6557 -0.125022 0.454862
