program: Gaussian 09
title: 000014507
version: EM64L-G09RevD.01
frameworkgroup: C1[X(C4H8N2OS)]
method: RPBEPBE
basis: SDD
operation: Freq
keyword: #p
keyword: freq=noraman
keyword: PBEPBE/SDD
title: #p freq=noraman PBEPBE/SDD
converged: YES YES NO NO
title: Mulliken charges:
elementType: S O N N C C C C H H H H H H H H
charge: 0.744358 -0.598192 -0.292360 -0.290018 -0.417010 -0.422681 -0.428741 -0.414338 0.258952 0.260093 0.279320 0.260614 0.260201 0.284202 0.256893 0.258707
chargesum: 0.00000
title: Mulliken charges with hydrogens summed into heavy atoms:
elementType: S O N N C C C C
charge: 0.744358 -0.598192 -0.292360 -0.290018 0.102035 0.117254 0.115661 0.101262
polarizability: 1.12570749e+02 -2.56328319e-01 7.37901416e+01 9.43954972e-02 -1.35110357e+00 6.32334122e+01
1716.lowfreq: -8.1724 -0.0020 -0.0012 -0.0010 9.5014 24.1520 41.3172 67.8839 124.2383
frequency: 40.5993 67.7534 124.2261 202.6678 214.6565 274.4700 279.3627 370.9607 406.5402 444.2209 474.5034 746.8005 752.2816 759.4024 765.8246 835.0585 842.3344 851.2605 959.9735 970.7010 1060.7290 1069.4791 1092.6451 1098.9621 1103.6410 1119.1938 1154.7963 1163.1811 1204.1950 1208.4557 1425.6165 1431.1986 1448.1920 1451.9066 3053.7440 3061.8776 3081.0577 3081.5131 3182.4363 3184.5429 3200.0359 3201.8852
redmass: 2.8332 3.9153 3.2319 6.2205 4.4685 2.8391 4.5354 4.9575 8.3297 4.3632 7.9542 1.6588 8.3773 1.6078 7.7554 17.6603 2.0239 2.2232 1.0847 1.0991 1.2272 1.2369 1.3119 1.3241 1.2849 1.2934 1.3600 1.3453 3.3481 3.3068 1.0927 1.0884 1.1591 1.1582 1.0569 1.0554 1.0557 1.0561 1.1139 1.1148 1.1158 1.1160
irintensity: 1.6329 4.1212 1.7580 20.1052 10.8950 0.6419 1.4950 10.7248 17.1526 2.4653 15.5561 44.1818 0.1968 7.0998 1.2355 39.3490 30.1563 24.5313 0.4450 1.3911 0.7380 42.1176 3.8480 9.1761 16.6290 6.5231 0.0379 2.0601 7.7881 7.6349 4.8478 16.6812 5.2048 10.8579 6.6690 9.8023 28.5684 1.5646 1.3443 1.2635 3.7614 4.1656
temp: 298.150 k
press: 1.00000 atm
elementType: 16 8 7 7 6 6 6 6 1 1 1 1 1 1 1 1
symmnumber: 1
zpe: 313797.7 jmol-1
zpe.correction: 0.119519 hartree
zpe.thermalcorrener: 0.128749 hartree
zpe.thermalcorrenthalpy: 0.129693 hartree
zpe.thermalcorrgfe: 0.084632 hartree
zpe.sumelectzpe: -739.182795 hartree
zpe.sumelectthermal: -739.173565 hartree
zpe.sumelectthermalent: -739.172621 hartree
zpe.sumelectthermalfe: -739.217683 hartree
dipole: -0.0420 0.8758 0.5633
dipole: 1.0421
quadrupole: -44.2818 -54.2184 -62.0612
quadrupole: 0.0688 0.1354 5.9347
quadrupole: 9.2387 -0.6980 -8.5407 0.0688 0.1354 5.9347
hfenergy: -739.3023143 hartree
pointgroup: C01 [X(C4H8N2O1S1)]
dipole: 0.0297989 0.1300337 0.3877015 debye
dipolederiv: 0.8721414 -0.0299556 -0.0373364 -0.0305316 0.5205654 -0.2790931 -0.0178168 -0.0495311 0.4854013 -0.556238 -0.0051069 0.0427044 -0.0087569 -0.6087365 0.419035 0.0021428 -0.009353 -0.4170193 -0.48559 0.0300516 0.1778466 0.2932838 -0.2570195 -0.1217439 0.3084741 -0.0039924 -0.168345 -0.5390033 0.016705 -0.1817872 -0.2384613 -0.202393 -0.0760956 -0.2763568 0.0630237 -0.1550317 0.1071856 0.1018514 -0.0896222 -0.077381 0.0714376 0.0312942 -0.0846982 -0.0045083 -0.0175995 0.0596339 0.0036775 -0.0545873 -0.1759088 -0.018882 -0.0514742 -0.0258118 -0.1375407 0.0092812 0.0880046 -0.0281647 0.0415983 0.1522072 -0.0679971 -0.0638152 -0.0133111 -0.1374681 0.0147995 0.1008361 -0.1026121 0.0990236 0.0730465 0.07909 0.0035744 0.0689637 -0.0296451 -0.0128382 -0.094964 -0.0632565 -0.0139016 -0.0348089 0.0835894 0.0160781 0.0011292 0.0228506 0.1052814 0.0739493 -0.0355651 0.0241658 0.0532144 0.0454866 0.081901 -0.0426008 0.0892797 0.0296823 0.1079921 -0.1047433 -0.0227482 -0.0299079 0.0281087 -0.0475702 -0.0178526 0.0251415 0.0628983 0.0648431 -0.0171759 0.0284011 0.0167412 0.099057 0.0171254 0.05173 0.0220411 -0.058719 0.0643604 0.0218334 -0.0268829 -0.0121528 0.1014135 0.0146472 -0.0459391 0.0219856 -0.0605621 0.1387179 0.0850463 0.0064153 0.0045505 0.0103538 -0.0464394 0.0240503 0.0247012 0.0655625 0.0668141 0.0311383 -0.0077235 -0.0527836 0.0587926 0.0860677 0.0648286 0.078089 0.0149233 -0.0686832 0.0962765 0.0144342 0.0676491 0.0571335 0.0165085 0.0030683 0.0249263 0.1022851 unknown
polarizability: 112.1570875|-4.4504855|64.8906403|-0.2567158|-3.6513446|72.5465746 unknown
InChI: InChI=1S/C4H8N2OS/c7-8(5-1-2-5)6-3-4-6/h1-4H2
charge 0 multiplicity 1
16 atoms
S  -0.021511 -0.476451 -1.309072
O  0.123557 1.169164 -1.198041
N  -1.469681 -1.001089 -0.129369
N  1.304197 -1.238299 -0.099655
C  -2.703132 -0.110988 -0.355753
C  -1.816451 0.124586 0.844314
C  1.890512 -0.151852 0.800869
C  2.693976 -0.640388 -0.380937
H  -3.64657 -0.656578 -0.26419
H  -2.66241 0.643087 -1.151451
H  -1.190231 1.027421 0.805241
H  -2.10011 -0.233153 1.837773
H  2.10645 -0.497185 1.815566
H  1.459717 0.855586 0.701576
H  2.804652 0.05262 -1.224065
H  3.503134 -1.365483 -0.254806
