program: Gaussian 09
title: 000120972
version: EM64L-G09RevD.01
frameworkgroup: C1[X(C21H28N2O2S)]
method: RPBEPBE
basis: SDD
operation: Freq
keyword: #p
keyword: freq=noraman
keyword: PBEPBE/SDD
title: #p freq=noraman PBEPBE/SDD
converged: YES YES NO NO
title: Mulliken charges:
elementType: S O O N N C C C C C C C C C C C C C C C C C C C C C H H H H H H H H H H H H H H H H H H H H H H H H H H H H
charge: 0.198106 -0.307167 -0.301634 -0.073946 -0.193649 -0.351884 -0.368795 -0.419224 -0.409344 -0.346191 -0.588061 0.495359 0.550295 -0.382222 -0.336716 -0.547773 -0.423597 -0.169462 -0.247670 -0.280873 0.219608 -0.339931 0.173375 -0.867343 -0.530624 -0.530365 0.203691 0.190812 0.198914 0.207106 0.193489 0.225965 0.235406 0.213502 0.224085 0.191279 0.216265 0.221455 0.241746 0.257124 0.237586 0.235925 0.223342 0.224992 0.246730 0.264102 0.261594 0.257701 0.228284 0.221348 0.254147 0.222134 0.252914 0.228087
chargesum: 0.00000
title: Mulliken charges with hydrogens summed into heavy atoms:
elementType: S O O N N C C C C C C C C C C C C C C C C C C C C C
charge: 0.198106 -0.307167 -0.301634 -0.073946 -0.193649 0.042619 0.037225 0.000230 0.039563 0.069173 -0.150341 0.495359 0.550295 -0.382222 -0.094970 -0.290649 -0.186011 0.066464 -0.024327 -0.055881 0.219608 -0.093201 0.173375 -0.083945 0.173156 0.172770
polarizability: 3.86830055e+02 1.66673834e+01 2.52122923e+02 1.12042146e+01 1.28131947e+00 1.90072967e+02
1716.lowfreq: -12.5502 -0.0015 -0.0014 -0.0011 0.7041 1.4332 12.2937 13.6361 22.3064
frequency: 11.0092 13.0545 22.2509 35.4998 48.6598 54.0369 61.4500 78.1862 89.5548 101.9569 110.5698 114.5707 148.2219 156.4845 157.9964 171.4417 181.3384 202.1847 226.1495 241.2234 248.2303 259.7120 266.3351 279.5920 296.7402 311.4250 324.7423 344.5910 354.7411 390.9023 409.2905 420.0189 435.7221 451.4973 471.6220 488.2850 490.3547 511.2810 553.5395 560.6290 574.2709 622.2390 649.3652 656.3922 672.7560 708.4667 722.6846 726.6056 732.3001 746.2801 751.1174 781.3787 793.9102 838.2620 844.7009 851.0122 886.8635 897.4354 919.1836 920.8398 944.5796 947.5057 955.4905 960.2407 966.7890 978.9398 984.3278 1002.4271 1025.6411 1028.2054 1039.0416 1047.0459 1059.3240 1067.3884 1089.8035 1097.6083 1112.7674 1114.8198 1123.6894 1127.0251 1139.1358 1145.5207 1153.1314 1156.1950 1162.2514 1173.6973 1193.5489 1195.6026 1209.8157 1227.8327 1244.4742 1252.2680 1265.8695 1272.5826 1282.0047 1289.0083 1305.3841 1334.8701 1341.6398 1343.9105 1348.8824 1360.2237 1365.6537 1368.4717 1378.6815 1391.5181 1399.7542 1423.4859 1426.1490 1442.0453 1451.9567 1453.7776 1455.5162 1456.3157 1458.1632 1458.3941 1461.6095 1464.5938 1470.7244 1476.4548 1477.7828 1483.7085 1485.2618 1487.7566 1570.8292 1573.9763 1592.2372 1613.5857 2844.5918 2859.4275 2876.7813 2894.3732 2913.0826 2969.9926 2972.0167 2995.4065 3004.6664 3017.4452 3030.4931 3041.4049 3053.6195 3060.6318 3066.1913 3068.1578 3071.0930 3118.6296 3119.6321 3121.8275 3126.4456 3127.2962 3130.6215 3140.5982 3140.9834 3153.1171 3160.4191 3166.5647
redmass: 4.3685 4.9689 4.8643 4.2696 3.5406 3.4241 3.6822 3.8513 4.0599 3.1871 3.6949 3.0412 1.3147 1.1882 2.3992 2.8579 2.9942 3.2900 3.5652 1.3782 3.1842 3.0181 2.4797 2.9385 4.2116 3.3547 2.5482 4.4216 4.2258 2.1806 5.5234 4.1695 4.1450 3.2491 3.2833 3.5988 3.6556 4.8220 3.8703 4.2878 4.7237 3.3847 4.6401 3.8266 6.0200 6.0583 4.0159 3.2746 3.6238 3.4377 1.4791 3.1104 1.2301 1.5320 1.4270 1.5174 4.0751 1.6856 2.9643 1.5490 3.0503 3.3967 1.4748 1.1861 1.3114 3.6667 1.2956 2.6973 5.4015 2.0102 2.4686 2.2445 1.9891 1.9447 2.5550 2.2941 1.2458 1.2403 1.9530 2.5282 1.7497 2.4816 1.3572 1.4958 1.8905 1.0591 1.4012 1.3768 1.6491 1.5682 2.1161 1.3189 1.8660 1.4747 1.2509 1.5853 1.4290 1.3069 1.2222 1.4063 1.5056 1.7974 4.1955 2.5102 1.9474 1.4207 2.3049 1.1790 2.1852 1.3652 1.0818 1.0544 1.1133 1.0548 1.1054 1.1479 1.1258 1.0879 1.1097 1.9126 1.0761 1.1766 2.2676 1.0693 6.2002 7.2768 6.1351 6.7805 1.0708 1.0703 1.0694 1.0688 1.0698 1.0308 1.0311 1.0606 1.0290 1.0867 1.0898 1.0896 1.0904 1.1025 1.1037 1.1036 1.0913 1.1027 1.1028 1.1061 1.0847 1.0889 1.1016 1.0891 1.0916 1.0937 1.0957 1.0996
irintensity: 0.0261 0.0498 0.0262 0.6934 2.1548 0.4708 0.3635 3.2675 2.1949 2.1380 6.0465 1.4554 0.9710 0.1569 0.4772 5.7332 6.8922 0.4059 6.4665 2.2598 3.0431 2.1655 2.8751 4.4377 0.5793 2.6452 8.7672 0.2024 0.8964 0.0957 0.8900 0.5141 8.4436 8.1207 1.6298 6.3789 3.9911 4.7428 5.9776 11.2401 10.2345 4.3324 4.4012 12.3259 6.3673 10.5266 3.6021 19.1247 3.6133 4.1125 72.9869 1.6411 0.9054 35.4674 1.2915 1.3031 17.7705 7.0473 33.2804 8.2496 53.0518 16.9077 7.6202 7.5325 0.2747 52.4072 5.5097 56.8189 39.4430 2.2163 24.8145 3.9606 13.4172 6.6993 38.3330 27.4103 18.2905 3.7789 12.0131 85.2063 7.3759 41.7254 0.5389 8.3983 4.6456 0.2678 32.4437 18.9554 5.8520 100.7433 76.2531 37.7049 26.0770 15.5230 8.3250 10.0710 28.0909 6.6011 4.6340 13.0495 2.2757 4.0780 38.8806 22.2260 13.9586 3.1587 13.9653 1.4007 24.1732 15.9551 3.1066 12.1878 24.0887 16.5570 52.3723 43.2669 16.9126 6.6379 1.8620 76.9504 10.3906 28.9961 98.3746 39.8990 2.8163 8.6168 57.0593 7.6443 60.1738 64.2987 65.7546 82.6492 108.8806 95.2599 58.2894 21.9753 32.8242 15.2888 49.6398 52.6076 23.2561 29.7027 32.3752 24.2701 8.3562 26.7876 25.3446 18.5867 1.1713 12.0461 10.9567 11.6848 7.3932 27.0059 8.4839 26.1776
temp: 298.150 k
press: 1.00000 atm
elementType: 16 8 8 7 7 6 6 6 6 6 6 6 6 6 6 6 6 6 6 6 6 6 6 6 6 6 1 1 1 1 1 1 1 1 1 1 1 1 1 1 1 1 1 1 1 1 1 1 1 1 1 1 1 1
symmnumber: 1
zpe: 1177098.9 jmol-1
zpe.correction: 0.448333 hartree
zpe.thermalcorrener: 0.475193 hartree
zpe.thermalcorrenthalpy: 0.476137 hartree
zpe.thermalcorrgfe: 0.387478 hartree
zpe.sumelectzpe: -1473.019900 hartree
zpe.sumelectthermal: -1472.993040 hartree
zpe.sumelectthermalent: -1472.992096 hartree
zpe.sumelectthermalfe: -1473.080755 hartree
dipole: -0.3910 0.8345 -0.0263
dipole: 0.9219
quadrupole: -141.8231 -150.8197 -165.9547
quadrupole: -3.8397 -4.0484 1.0555
quadrupole: 11.0427 2.0461 -13.0889 -3.8397 -4.0484 1.0555
hfenergy: -1473.4682335 hartree
pointgroup: C01 [X(C21H28N2O2S1)]
dipole: 0.1445507 -0.3206252 0.0887031 debye
polarizability: 387.3993304|8.3026197|245.1527808|-16.5310977|-18.3933766|196.4738345 unknown
InChI: InChI=1S/C21H28N2O2S/c1-24-19-9-8-17(16-20(19)25-2)10-11-22-12-14-23(15-13-22)18-6-4-5-7-21(18)26-3/h4-9,16H,10-15H2,1-3H3
charge 0 multiplicity 1
54 atoms
S  4.618309 -2.162635 0.923846
O  -6.012306 -1.490564 -1.2397
O  -7.417322 0.00095 0.857306
N  0.476991 0.687657 0.190016
N  3.311106 0.283616 -0.252157
C  1.027228 0.458525 -1.169879
C  1.32814 0.015043 1.207445
C  2.478066 0.965194 -1.264823
C  2.776381 0.517586 1.117945
C  -0.945792 0.293963 0.320719
C  -1.911313 1.223366 -0.463468
C  4.728823 0.289488 -0.427477
C  -3.365624 0.911514 -0.143781
C  5.522307 -0.770842 0.123165
C  5.386962 1.29988 -1.180217
C  -4.051809 -0.124584 -0.825154
C  -4.050726 1.608463 0.884968
C  6.926059 -0.754995 -0.0294
C  6.787358 1.289838 -1.359861
C  7.562237 0.271092 -0.767144
C  -5.384486 -0.455533 -0.503265
C  -5.39242 1.301074 1.198793
C  -6.0752 0.282861 0.500564
C  6.025545 -3.302812 1.42339
C  -6.433719 -2.655221 -0.426645
C  -8.401827 0.245123 -0.222893
H  0.414055 1.00623 -1.907744
H  1.008971 -0.628423 -1.438592
H  1.328766 -1.096149 1.077645
H  0.922896 0.245371 2.210548
H  2.473793 2.072571 -1.122316
H  2.879801 0.742597 -2.269147
H  3.400485 -0.014483 1.854272
H  2.800694 1.606771 1.354449
H  -1.21053 0.350006 1.394007
H  -1.117845 -0.766413 0.000289
H  -1.736678 1.113949 -1.550283
H  -1.665398 2.266697 -0.193012
H  4.793221 2.111187 -1.614203
H  -3.559901 -0.700104 -1.617707
H  -3.53651 2.408102 1.431198
H  7.538564 -1.555617 0.396078
H  7.267983 2.082315 -1.944114
H  8.651148 0.258151 -0.884831
H  -5.937576 1.848975 1.974381
H  6.590916 -3.636872 0.53928
H  6.691453 -2.815476 2.152822
H  5.536354 -4.169173 1.895404
H  -6.939123 -3.335412 -1.129194
H  -5.546943 -3.154403 0.008401
H  -7.122689 -2.34696 0.380215
H  -8.424541 1.321339 -0.479754
H  -8.158155 -0.348515 -1.122503
H  -9.374381 -0.061509 0.191718
