program: Gaussian 09
title: 000014504
version: EM64L-G09RevD.01
frameworkgroup: C1[X(C6H7NO)]
method: RPBEPBE
basis: SDD
operation: Freq
keyword: #pfreq=noraman
keyword: PBEPBE/SDD
title: #p freq=noraman PBEPBE/SDD
converged: YES YES NO YES
title: Mulliken charges:
elementType: O N C C C C C C H H H H H H H
charge: -0.218065 -0.153734 0.337523 -0.212720 -0.338978 -0.636947 -0.265083 -0.188647 0.253107 0.277677 0.232011 0.249657 0.249654 0.250679 0.163866
chargesum: 0.00000
title: Mulliken charges with hydrogens summed into heavy atoms:
elementType: O N C C C C C C
charge: -0.218065 -0.153734 0.337523 0.040386 -0.061301 0.094376 -0.014404 -0.024781
polarizability: 1.05328966e+02 4.51095495e+00 8.11599465e+01 -8.09916344e-03 -2.01919818e-03 3.49221543e+01
1716.lowfreq: -8.3307 -2.5429 -0.0004 0.0005 0.0006 6.0677 128.1097 154.3969 186.0877
frequency: 128.1052 154.3945 186.0873 191.8562 275.8279 330.9125 526.4827 600.8019 627.1565 631.2211 747.6153 786.1952 823.7844 880.9700 900.9279 964.1724 1007.8394 1054.5895 1086.9777 1116.9956 1169.3853 1237.1681 1320.6545 1343.2318 1404.0737 1425.0048 1431.6689 1472.3016 1481.7451 1493.2364 1528.1342 1598.4390 2856.6995 2996.6751 3082.3445 3113.4645 3209.9644 3225.4044 3242.9408
redmass: 1.0920 4.3694 2.6175 5.0369 2.5534 3.5151 5.1612 2.9449 4.7043 3.8218 1.2277 5.0272 1.3644 4.3291 1.3509 1.7682 1.5119 1.5387 1.2731 1.3180 2.7573 1.5661 4.1116 2.4355 2.3160 1.5875 3.1551 1.0420 1.9662 1.1893 4.9234 5.9949 1.0822 1.0346 1.1024 1.1003 1.0903 1.0973 1.1086
irintensity: 0.4397 1.8038 0.0224 4.2691 20.0838 6.3481 0.3758 7.7956 11.7960 4.3766 99.0822 24.4398 7.1631 2.4149 1.3778 2.2089 10.2553 35.6420 16.3582 0.8170 1.8781 9.4384 67.5911 18.0709 37.6547 31.9781 3.4382 15.9904 104.9101 1.0667 33.7726 279.4656 127.0143 45.9461 18.9878 11.6940 1.6634 0.4888 3.0715
temp: 298.150 k
press: 1.00000 atm
elementType: 8 7 6 6 6 6 6 6 1 1 1 1 1 1 1
symmnumber: 1
zpe: 308968.2 jmol-1
zpe.correction: 0.117680 hartree
zpe.thermalcorrener: 0.125090 hartree
zpe.thermalcorrenthalpy: 0.126035 hartree
zpe.thermalcorrgfe: 0.085910 hartree
zpe.sumelectzpe: -362.204814 hartree
zpe.sumelectthermal: -362.197403 hartree
zpe.sumelectthermalent: -362.196459 hartree
zpe.sumelectthermalfe: -362.236583 hartree
dipole: -4.7838 2.7227 0.0005
dipole: 5.5044
quadrupole: -54.9053 -38.4919 -49.5533
quadrupole: 0.5220 0.0005 -0.0007
quadrupole: -7.2551 9.1583 -1.9031 0.5220 0.0005 -0.0007
hfenergy: -362.3224933 hartree
pointgroup: C01 [X(C6H7N1O1)]
dipole: -1.8293362 -1.1589917 -0.0001912 debye
dipolederiv: -1.278232 0.0273141 -0.0001087 -0.4207644 -0.4254323 -0.0000594 -0.0000961 -0.0000016 -0.3494587 0.302096 0.0658938 0.0000004 -0.0010792 -0.8185546 -0.0000043 0.0000474 -0.0000845 -0.1026045 -0.901256 0.3999923 -0.0000571 0.6992159 -0.0299428 0.000108 -0.0001017 0.0000432 -0.0449521 -0.2311139 -0.1823526 -0.0000035 0.3191171 0.3702633 0.0000275 0.0000412 0.0000274 -0.1669361 0.3483865 0.0124555 0.0000852 -0.2673073 -0.0600742 -0.0000497 0.0000487 -0.0000046 -0.1678312 0.1436647 -0.0061875 -0.0000006 0.02966 0.5284134 0.0000112 -0.0000076 0.0000102 0.2120629 -0.3325225 -0.1101674 -0.0000114 -0.3063156 -0.1198681 -0.0000755 0.0000329 -0.0000242 -0.2405988 1.7623773 -0.1832281 0.0001782 -0.0586932 0.745599 0.0000536 0.0001513 0.0000368 0.1127193 0.0028954 -0.0513733 -0.0000157 -0.0872573 0.0561593 0.0000056 -0.0000913 -0.0000002 0.2050065 0.0716048 -0.0653765 -0.0000188 -0.0428988 0.0469397 0.0000009 -0.0000156 0.0000233 0.1924335 -0.0975957 -0.1093007 0.0000158 0.0073967 0.0619517 0.0000007 0.0000097 0.000006 0.1249692 0.0626177 0.0806346 0.0919055 -0.005882 -0.0243323 -0.0306474 0.0656512 -0.0854348 -0.0412561 0.0626026 0.080644 -0.0919268 -0.0058954 -0.0243099 0.03062 -0.0656595 0.0854314 -0.0412569 0.032537 0.0847502 -0.0000323 0.0871853 0.0105641 0.000034 -0.0000202 0.0000185 0.2032064 0.051938 -0.0436985 -0.0000103 0.0535183 -0.3173763 -0.0000252 0.0000097 -0.0000469 0.1044965 unknown
polarizability: 105.701009|-3.3493857|80.7879035|0.0081856|-0.001634|34.9221543 unknown
InChI: InChI=1S/C6H7NO/c1-7-4-2-3-6(7)5-8/h2-5H,1H3
charge 0 multiplicity 1
15 atoms
O  2.809464 0.273699 0.000368
N  -0.755679 -0.704165 -0.000026
C  0.405327 0.104907 0.000146
C  -1.87065 0.117572 -0.000053
C  -0.02343 1.456246 0.000116
C  -0.790505 -2.174494 0.000048
C  -1.445491 1.463709 -0.000253
C  1.756262 -0.432664 0.000265
H  -2.877003 -0.299198 -0.00013
H  0.653884 2.308273 0.000207
H  -1.841014 -2.505423 0.000123
H  -0.296238 -2.583656 -0.898192
H  -0.296154 -2.583531 0.898295
H  -2.099938 2.333431 -0.000473
H  1.833464 -1.550405 0.00016
