program: Gaussian 09
title: 000120971
version: EM64L-G09RevD.01
frameworkgroup: C1[X(C22H30N2O2)]
method: RPBEPBE
basis: SDD
operation: Freq
keyword: #p
keyword: freq=noraman
keyword: PBEPBE/SDD
title: #p freq=noraman PBEPBE/SDD
converged: YES YES NO NO
title: Mulliken charges:
elementType: O O N N C C C C C C C C C C C C C C C C C C C C C C H H H H H H H H H H H H H H H H H H H H H H H H H H H H H H
charge: -0.307079 -0.301763 -0.076242 -0.227301 -0.378940 -0.357629 -0.390646 -0.368904 -0.348145 0.126367 -0.583834 0.359400 0.357467 0.552551 -0.419535 -0.421998 -0.820233 -0.816336 -0.246698 -0.555170 -0.416160 0.222452 -0.341307 0.173243 -0.530776 -0.530214 0.189678 0.207675 0.201430 0.181728 0.208029 0.208904 0.212678 0.195228 0.192292 0.222352 0.214615 0.222029 0.228756 0.226050 0.237335 0.220678 0.219590 0.224150 0.233252 0.231090 0.222264 0.256862 0.236827 0.246808 0.254427 0.220922 0.228499 0.228271 0.252807 0.222201
chargesum: 0.00000
title: Mulliken charges with hydrogens summed into heavy atoms:
elementType: O O N N C C C C C C C C C C C C C C C C C C C C C C
charge: -0.307079 -0.301763 -0.076242 -0.227301 0.018413 0.025530 0.026287 0.039002 0.066499 0.126367 -0.147190 0.359400 0.357467 0.552551 -0.190778 -0.195948 -0.142630 -0.127844 -0.024433 -0.298308 -0.179333 0.222452 -0.094499 0.173243 0.173072 0.173065
polarizability: 3.79136092e+02 3.95195480e+00 2.30908751e+02 1.39280257e+01 -8.11644392e-01 1.90681640e+02
1716.lowfreq: -10.3832 -4.5306 -0.0009 -0.0003 0.0005 2.3485 9.9938 17.7075 22.2334
frequency: 7.1562 16.4521 22.2300 36.2463 58.5114 61.1046 81.2098 83.3332 95.2760 108.2145 114.0700 131.8202 153.1956 158.7249 170.9128 181.8582 187.0426 199.6392 219.3920 227.4794 253.9573 260.9177 263.9894 276.7752 289.5132 316.9239 328.5331 339.6042 351.0993 363.3965 393.5154 419.6737 432.3171 470.2031 484.5821 484.6505 494.8349 511.5174 535.6940 544.4233 561.7210 574.2356 582.1767 644.9583 652.6648 708.3140 722.0624 746.0650 749.4993 758.5089 773.2933 779.4537 789.3123 837.2443 845.1558 886.3327 896.0000 899.7659 912.3405 924.9865 941.5529 946.4769 954.8428 965.9748 978.0990 983.2578 1000.2596 1024.8404 1028.4582 1037.3299 1042.7967 1044.9272 1047.4704 1053.9840 1084.5165 1092.4626 1104.9554 1113.8979 1114.8309 1125.5661 1138.9256 1144.3707 1153.3824 1158.0297 1168.4818 1174.4105 1192.2550 1194.9068 1210.1466 1220.1601 1243.9599 1249.2991 1261.0427 1264.0880 1267.6285 1282.8932 1286.5327 1301.3438 1328.5561 1341.6747 1347.2369 1357.7823 1359.6719 1366.5723 1371.2495 1386.4960 1390.9725 1397.7058 1399.7746 1424.7744 1441.6774 1442.9845 1447.1184 1451.4161 1451.8743 1454.8183 1457.7169 1459.0650 1460.0477 1466.2339 1469.6245 1474.9012 1477.8664 1483.3854 1484.6234 1486.4886 1488.7820 1489.2034 1573.9195 1585.4871 1600.7983 1613.3532 2845.3708 2847.5267 2863.8092 2897.0099 2908.9429 2965.4958 2969.5355 2971.6412 2976.1474 2993.9757 3017.8383 3025.9211 3038.8791 3042.1672 3051.8528 3056.3271 3059.2645 3065.5701 3065.6478 3068.0783 3083.9294 3084.0960 3112.7053 3118.6546 3119.8122 3120.5481 3126.6140 3140.0737 3151.8138 3160.2730
redmass: 3.8656 4.6234 4.5093 4.3321 3.7703 3.0404 3.3478 3.2016 3.6391 3.1451 3.0495 1.1161 1.5256 1.7835 1.9407 1.6851 2.0811 1.1318 2.7388 3.2270 3.5013 2.7561 2.2893 2.8336 3.5792 2.6819 3.0920 3.6989 4.1047 3.7226 2.0201 3.8297 3.9474 2.9989 3.5439 3.5453 4.3035 3.0507 4.8910 5.1667 3.3840 4.5450 3.2149 3.8344 2.6913 5.9979 4.1714 3.5303 4.0955 4.8689 1.2254 3.2012 1.2289 1.5432 1.5551 4.2845 1.3105 1.6304 2.6742 3.1567 2.3699 4.8329 1.4966 1.3410 3.5741 1.6257 2.6262 1.8377 1.8586 2.3019 1.7155 1.7096 1.7907 2.0109 2.2176 2.6303 1.6592 1.2469 1.2425 2.3925 1.8884 2.1263 1.3301 1.4849 1.8377 1.1636 1.6977 1.2070 1.9764 2.0075 2.0757 1.5027 2.2883 2.1285 1.6950 1.2478 1.6599 1.4225 1.2848 1.3430 1.8468 2.1739 2.0726 4.9354 1.6867 1.4051 1.2695 1.2426 2.3269 1.1794 1.6477 1.3607 1.2695 1.2287 1.4370 1.1473 1.0600 1.1017 1.0661 1.1811 1.1027 1.0763 1.0750 1.1007 2.6309 1.1812 1.0758 1.2519 7.2780 7.2382 5.5832 6.8042 1.0709 1.0698 1.0691 1.0711 1.0676 1.0395 1.0309 1.0313 1.0380 1.0607 1.0875 1.0888 1.0893 1.0926 1.0930 1.0943 1.1026 1.1038 1.0892 1.1034 1.0995 1.0993 1.0855 1.1026 1.1027 1.0916 1.0888 1.0918 1.0991 1.0956
irintensity: 0.0632 0.0035 0.0114 0.1741 0.5205 0.7384 5.4352 0.6988 0.1439 5.7494 2.8067 0.4025 0.5912 0.6182 3.2773 1.8491 7.4181 1.2443 3.3360 6.8530 4.3404 2.9837 1.3232 3.7251 1.9361 7.8791 5.1720 2.4780 4.0736 3.1951 0.4115 0.8085 6.9669 2.3035 1.5812 2.1875 4.1831 3.3382 6.5523 4.8844 2.2021 11.4228 8.2134 4.5634 8.1808 10.4468 8.5270 4.9117 2.4838 0.7693 54.5146 0.4979 0.4451 37.0621 0.5976 15.4564 0.8709 8.8347 4.1773 17.5668 15.0384 49.9055 8.3800 0.3809 52.2019 12.7421 57.9428 6.6248 6.0186 25.3073 6.3124 6.4753 5.5150 16.6875 1.2682 73.1324 28.7513 21.0011 2.2236 67.7167 11.8511 38.5554 0.4616 6.6627 13.5888 1.7618 46.8744 2.3479 58.4396 6.2188 76.5494 24.2956 38.4882 11.9657 23.4867 5.8079 11.7572 20.4297 12.2358 8.5151 3.8151 3.6420 13.7328 9.4757 55.5450 2.4569 12.4760 9.4371 14.6496 1.5078 56.0847 15.5683 5.4015 2.7544 25.3930 16.2456 11.0054 14.7495 9.3885 9.2230 1.1212 17.6419 13.2431 18.1512 137.5704 16.8050 62.2745 43.6989 8.9958 1.6693 12.8256 8.0246 44.5950 51.7811 124.6239 76.5494 110.2451 38.8707 95.4971 58.5123 39.2403 23.5623 7.6852 59.2211 57.2607 22.9731 5.1912 36.6528 34.6050 30.2751 28.5537 24.9282 11.7504 35.5546 2.4061 26.9677 25.2955 32.4264 12.5719 7.4943 41.8735 8.3043
temp: 298.150 k
press: 1.00000 atm
elementType: 8 8 7 7 6 6 6 6 6 6 6 6 6 6 6 6 6 6 6 6 6 6 6 6 6 6 1 1 1 1 1 1 1 1 1 1 1 1 1 1 1 1 1 1 1 1 1 1 1 1 1 1 1 1 1 1
symmnumber: 1
zpe: 1245048.2 jmol-1
zpe.correction: 0.474214 hartree
zpe.thermalcorrener: 0.501027 hartree
zpe.thermalcorrenthalpy: 0.501971 hartree
zpe.thermalcorrgfe: 0.414175 hartree
zpe.sumelectzpe: -1114.267549 hartree
zpe.sumelectthermal: -1114.240737 hartree
zpe.sumelectthermalent: -1114.239792 hartree
zpe.sumelectthermalfe: -1114.327588 hartree
dipole: 1.0617 0.2814 0.0674
dipole: 1.1004
quadrupole: -151.8394 -148.8501 -157.7936
quadrupole: 4.0037 -2.1146 1.0624
quadrupole: 0.9883 3.9776 -4.9659 4.0037 -2.1146 1.0624
hfenergy: -1114.7417632 hartree
pointgroup: C01 [X(C22H30N2O2)]
dipole: -0.4151322 -0.1162949 0.0397664 debye
polarizability: 378.9262929|5.6627032|230.7233013|-14.3916574|-4.2380397|191.0768891 unknown
InChI: InChI=1S/C22H30N2O2/c1-17-6-5-7-18(2)22(17)24-14-12-23(13-15-24)11-10-19-8-9-20(25-3)21(16-19)26-4/h5-9,16H,10-15H2,1-4H3
charge 0 multiplicity 1
56 atoms
O  -5.914113 -1.622331 -1.263914
O  -7.349277 -0.083583 0.776117
N  0.566771 0.57619 0.354955
N  3.415242 0.26664 0.090977
C  1.383611 0.110504 1.505307
C  1.173691 0.125579 -0.923763
C  2.824109 0.644572 1.388682
C  2.604261 0.685324 -1.063199
C  -0.861263 0.204733 0.492505
C  4.820168 -0.003255 -0.019211
C  -1.795461 1.048059 -0.418151
C  5.327947 -1.221473 0.544967
C  5.714303 0.899925 -0.682968
C  -3.261662 0.757933 -0.135457
C  6.707161 -1.517546 0.42427
C  7.082274 0.551477 -0.804682
C  4.404701 -2.212906 1.228351
C  5.249967 2.251253 -1.204753
C  7.584936 -0.646534 -0.255444
C  -3.944374 -0.279355 -0.817878
C  -3.963666 1.4807 0.864168
C  -5.289838 -0.586546 -0.525857
C  -5.316607 1.196381 1.148577
C  -5.995229 0.176053 0.449104
C  -6.37313 -2.769886 -0.447205
C  -8.30396 0.16174 -0.330093
H  1.415252 -1.007824 1.560485
H  0.924534 0.488524 2.438228
H  0.561815 0.495715 -1.766214
H  1.210133 -0.992946 -0.983217
H  2.796291 1.754012 1.50507
H  3.444109 0.23874 2.205925
H  3.065626 0.293393 -1.986908
H  2.523329 1.793123 -1.153016
H  -1.034893 -0.883215 0.288581
H  -1.155224 0.381614 1.544787
H  -1.569175 0.839854 -1.48066
H  -1.563463 2.113472 -0.235816
H  7.087563 -2.454846 0.848768
H  7.762363 1.246101 -1.313245
H  3.437774 -2.268947 0.696268
H  4.861124 -3.217321 1.260654
H  4.176335 -1.922898 2.27328
H  6.116293 2.911289 -1.383242
H  4.693781 2.171784 -2.157957
H  4.581512 2.751176 -0.480954
H  8.647586 -0.895666 -0.351415
H  -3.440494 -0.873764 -1.588682
H  -3.452976 2.28347 1.40935
H  -5.873851 1.763804 1.901188
H  -7.074064 -2.440525 0.34079
H  -5.504808 -3.279156 0.012755
H  -6.874944 -3.44965 -1.152735
H  -9.290444 -0.126896 0.0640
H  -8.046914 -0.445444 -1.216846
H  -8.305733 1.235177 -0.599329
