program: Gaussian 09
title: 000120925
version: EM64L-G09RevD.01
frameworkgroup: C1[X(C22H27N2O)]
method: RPBEPBE
basis: SDD
operation: Freq
keyword: #p
keyword: freq=noraman
keyword: PBEPBE/SDD
title: #p freq=noraman PBEPBE/SDD
converged: NO YES NO NO
title: Mulliken charges:
elementType: O N N C C C C C C C C C C C C C C C C C C C C C C H H H H H H H H H H H H H H H H H H H H H H H H H H H
charge: -0.222211 -0.092010 -0.447088 -0.179108 0.056676 -0.443356 -0.535035 -0.568871 -0.612480 -0.414375 0.172370 -0.345511 0.215434 0.564842 0.303372 0.220897 -0.388065 -0.398180 -0.395094 -0.241943 -0.364087 -0.665117 -0.251534 -0.197308 -0.752966 0.309576 0.278279 0.290685 0.293301 0.292564 0.240989 0.288042 0.271410 0.270265 0.311529 0.248609 0.262194 0.321386 0.234167 0.241989 0.219840 0.226955 0.154513 0.259414 0.250978 0.222608 0.219647 0.245998 0.250906 0.246149 0.290865 0.237892
chargesum: 1.00000
title: Mulliken charges with hydrogens summed into heavy atoms:
elementType: O N N C C C C C C C C C C C C C C C C C C C C C C
charge: -0.222211 -0.092010 -0.125703 0.130468 0.056676 0.125608 0.050830 -0.039840 -0.070805 -0.102847 0.172370 0.165292 0.215434 0.564842 0.303372 0.220897 0.088091 -0.178340 -0.168139 -0.087430 -0.104673 0.028116 -0.005536 0.053598 0.021940
polarizability: 2.89394920e+02 -3.53708554e+01 3.11248896e+02 1.32094416e+00 -5.75171119e-01 1.61888275e+02
1716.lowfreq: -4.1925 0.0005 0.0006 0.0008 9.4053 13.2378 50.0278 59.1480 73.4453
frequency: 50.0146 59.1365 73.4201 79.7582 88.6377 103.7084 119.8987 125.3090 145.8798 164.0769 169.0651 212.5821 230.6279 235.2245 245.4717 252.3587 259.2771 267.3254 292.6639 320.3268 328.8466 343.3865 374.8713 390.8339 395.8902 428.8176 450.2133 468.8446 492.0872 505.4660 537.4991 546.9328 557.7369 578.3667 587.0032 610.6676 613.4407 648.8370 660.7426 681.1403 702.8346 714.1125 753.7949 761.1786 762.0882 784.1761 801.6155 804.4163 843.6206 850.5983 861.3839 865.5050 880.2008 901.5321 909.8445 925.5805 932.1723 939.4097 946.6598 950.2587 969.6165 990.7209 991.1241 1010.7994 1019.7752 1024.9998 1030.6378 1043.3776 1047.2770 1052.4319 1065.6262 1092.0051 1106.9878 1111.5462 1126.9204 1138.1747 1154.0883 1165.5101 1172.9959 1177.6119 1188.8207 1200.5008 1212.6848 1232.0645 1246.1629 1250.2116 1258.2148 1263.6597 1278.3818 1290.8987 1299.8087 1301.4528 1309.8944 1318.9004 1329.5897 1335.2278 1349.0242 1350.8130 1351.5287 1356.8016 1374.7831 1381.4226 1383.7656 1406.1828 1406.6780 1416.7972 1454.8341 1458.9464 1466.7672 1468.4159 1469.2472 1473.8475 1475.7077 1477.4512 1483.8342 1484.0239 1486.0923 1494.8762 1565.5598 1608.1792 1625.3344 1643.8826 1672.0855 2858.2394 2973.5195 2991.7538 2997.9978 2999.1762 3000.1556 3007.6936 3015.7605 3032.8271 3047.9189 3049.2853 3049.9403 3053.4026 3066.2910 3076.2175 3077.2801 3090.3741 3093.0846 3101.8598 3109.6447 3111.7248 3116.4707 3124.5170 3148.4935 3160.8767 3178.2630 3581.2326
redmass: 4.0782 3.2585 4.1295 3.8628 2.2865 2.5082 2.1054 3.3249 2.8386 4.3239 2.8117 2.1847 1.3087 2.3075 2.6289 3.6838 2.9795 3.4241 2.9855 3.2100 3.5079 4.2894 3.4414 3.1991 4.1381 2.1514 2.9108 3.1759 3.7417 3.1009 4.0251 3.3191 2.2918 2.0112 3.2248 4.2679 4.0852 4.6233 4.6006 4.6444 4.6567 3.7911 3.4581 1.2776 1.1796 3.6891 2.8027 2.5637 1.8167 2.2790 1.9585 1.5765 2.7550 2.2332 1.5418 2.2277 2.0502 1.4874 1.8561 1.9141 2.8950 1.3421 2.7400 3.2081 2.1186 2.1975 2.1090 2.5908 1.5816 2.6905 2.1042 2.7326 2.2759 2.2687 2.2857 2.2223 1.5764 1.7368 1.5537 1.1255 2.1639 2.6270 1.4533 1.6896 1.6409 1.7641 1.3334 1.7906 1.2861 1.5019 1.1891 1.3269 1.4664 1.2992 1.3605 1.4460 1.4721 1.9783 1.3521 1.7437 1.3802 1.3474 1.9009 1.1999 1.2018 3.4216 1.0966 2.8574 1.1065 1.1720 1.1529 1.8131 1.0597 1.0776 1.0410 1.0678 1.0874 1.0946 6.6200 6.8461 6.6244 8.1116 6.9226 1.0834 1.0405 1.0370 1.0646 1.0675 1.0738 1.0583 1.0660 1.0626 1.0922 1.0700 1.0934 1.0878 1.0899 1.1025 1.1022 1.1006 1.1030 1.0993 1.0993 1.1040 1.0904 1.1063 1.0884 1.0937 1.1000 1.0796
irintensity: 0.9388 0.1038 1.4985 0.1111 0.4576 0.5398 0.5456 5.2781 2.6300 4.6629 5.3006 4.3830 1.1639 3.6523 0.3163 1.4635 2.1483 1.4296 1.0693 3.0517 2.2458 4.5674 3.1001 3.7087 2.0976 1.0789 8.7639 3.1993 3.4046 4.7965 4.7358 2.8747 23.4470 48.3328 16.3483 7.0318 10.4087 9.8473 1.5319 1.3788 5.8861 4.2024 8.3563 42.9803 54.7846 8.4802 10.3274 34.1304 13.2695 17.3783 1.0064 7.7137 2.9417 4.4634 6.0120 20.5815 8.2518 0.9971 0.8982 36.3824 13.9171 0.7474 15.2948 19.1436 5.4077 6.4869 31.2436 4.6801 0.3571 7.6661 16.4017 2.0847 10.6078 9.2199 2.9320 10.1802 3.8962 49.0602 15.2600 2.0103 2.3758 76.6257 30.0956 35.6405 5.3679 7.1583 14.9095 15.7560 4.8876 2.7525 0.8620 13.4098 8.5326 6.2672 8.1446 7.5833 17.9569 23.9224 12.9201 15.8028 1.4365 4.6535 79.7846 1.4680 37.2209 7.4837 11.5664 123.1712 23.9814 13.3634 3.0557 35.6613 6.7317 27.8020 13.4187 38.6892 28.0317 24.8060 333.4996 2.2526 157.0211 327.8474 21.3388 108.8320 14.0672 17.1848 14.6630 2.4756 0.7660 20.8707 28.1157 9.8644 15.6595 3.3300 1.3217 11.0422 16.4673 5.1504 8.6143 10.9531 42.3480 17.2034 2.8781 3.4433 16.6037 7.3027 2.2801 7.3508 9.2828 47.2615
temp: 298.150 k
press: 1.00000 atm
elementType: 8 7 7 6 6 6 6 6 6 6 6 6 6 6 6 6 6 6 6 6 6 6 6 6 6 1 1 1 1 1 1 1 1 1 1 1 1 1 1 1 1 1 1 1 1 1 1 1 1 1 1 1
symmnumber: 1
zpe: 1166938.9 jmol-1
zpe.correction: 0.444464 hartree
zpe.thermalcorrener: 0.466446 hartree
zpe.thermalcorrenthalpy: 0.467390 hartree
zpe.thermalcorrgfe: 0.395448 hartree
zpe.sumelectzpe: -1037.185043 hartree
zpe.sumelectthermal: -1037.163061 hartree
zpe.sumelectthermalent: -1037.162116 hartree
zpe.sumelectthermalfe: -1037.234059 hartree
dipole: -2.4938 -7.0833 1.6453
dipole: 7.6876
quadrupole: -94.4420 -133.7919 -140.6328
quadrupole: 12.9825 -0.5290 8.3239
quadrupole: 28.5136 -10.8364 -17.6772 12.9825 -0.5290 8.3239
hfenergy: -1037.6295065 hartree
pointgroup: C01 [X(C22H27N2O1)]
dipole: -0.7893844 -2.8581025 0.5966491 debye
polarizability: 294.0651771|-36.4683024|306.5199612|-1.3438655|3.1889103|161.9469532 unknown
InChI: InChI=1S/C22H27N2O/c1-3-10-24-11-9-22-18-7-5-6-8-19(18)23-21(22)17(14-25)16(12-20(22)24)15(4-2)13-24/h4-8,14,16,20,23H,3,9-13H2,1-2H3
charge 1 multiplicity 1
52 atoms
O  -0.360338 4.513991 -0.927904
N  -1.611399 -1.23186 0.018753
N  2.446038 1.357097 0.131537
C  -0.443956 -0.658255 -0.878136
C  0.691786 -0.219483 0.115753
C  -0.940111 -1.572023 1.358808
C  0.091143 -0.462783 1.561567
C  -0.977762 0.496321 -1.742135
C  -2.728375 -0.151434 0.198171
C  -1.249608 1.717387 -0.816249
C  1.069275 1.261211 -0.035495
C  -2.208764 -2.486815 -0.647317
C  2.047196 -0.918579 -0.006182
C  -2.225907 1.276881 0.293523
C  0.125242 2.225926 -0.351406
C  3.059628 0.073254 0.100061
C  -3.356244 -3.153259 0.131025
C  2.401324 -2.274193 -0.086721
C  -2.774458 2.090063 1.241827
C  0.456562 3.637007 -0.509853
C  4.425869 -0.251671 0.138456
C  -3.824742 -4.427685 -0.610353
C  3.777093 -2.624977 -0.063769
C  4.770359 -1.623879 0.053572
C  -2.57854 3.575533 1.396954
H  -0.101534 -1.50687 -1.493897
H  -0.46095 -2.55974 1.243743
H  -1.701241 -1.629755 2.151185
H  -0.387218 0.455635 1.935118
H  0.879237 -0.76491 2.2685
H  -1.877775 0.181687 -2.302642
H  -0.213683 0.759608 -2.493749
H  -3.313346 -0.437781 1.086907
H  -3.377751 -0.275251 -0.688971
H  -1.701448 2.549108 -1.391047
H  -1.372457 -3.198911 -0.773482
H  -2.548719 -2.17699 -1.652422
H  2.969304 2.230421 0.0808
H  -3.024334 -3.427397 1.150162
H  -4.211832 -2.462036 0.236164
H  1.644487 -3.063426 -0.176991
H  -3.46001 1.628267 1.97126
H  1.500768 3.937939 -0.239368
H  5.201684 0.515757 0.222331
H  -4.653275 -4.906468 -0.062344
H  -4.188805 -4.194542 -1.627355
H  -3.010357 -5.16947 -0.699025
H  4.073257 -3.675635 -0.13822
H  5.826367 -1.911679 0.073175
H  -3.55647 4.070097 1.545494
H  -2.079734 4.043389 0.534298
H  -1.980379 3.799279 2.303187
