program: Gaussian 09
title: 000014497
version: EM64L-G09RevD.01
frameworkgroup: C1[X(C4H6O2S)]
method: RPBEPBE
basis: SDD
operation: Freq
keyword: #pfreq=noraman
keyword: PBEPBE/SDD
title: #p freq=noraman PBEPBE/SDD
converged: YES YES NO NO
title: Mulliken charges:
elementType: S O O C C C C H H H H H H
charge: 0.907644 -0.551595 -0.551598 -0.588667 -0.416893 -0.368204 -0.081898 0.295859 0.295269 0.251092 0.251664 0.297683 0.259644
chargesum: 0.00000
title: Mulliken charges with hydrogens summed into heavy atoms:
elementType: S O O C C C C
charge: 0.907644 -0.551595 -0.551598 0.002462 0.085863 -0.070521 0.177745
polarizability: 8.70073509e+01 -2.55467796e+00 6.32072292e+01 3.96028772e-02 -7.43033394e-03 5.93988963e+01
1716.lowfreq: -24.0845 -18.3662 -10.5416 -0.0038 -0.0036 -0.0006 22.6975 167.2412 205.3111
frequency: 19.8823 167.2336 205.2874 272.8130 287.6024 399.3015 454.8272 532.9157 577.1754 687.4950 773.1357 777.4447 811.7939 885.7385 901.9825 925.2839 988.7335 1019.2823 1096.5217 1122.1788 1182.1100 1226.4916 1256.3224 1298.2172 1422.9028 1457.2168 1624.2216 3003.7420 3054.8560 3075.4308 3142.8790 3172.5999 3231.8061
redmass: 2.3151 4.3689 3.4913 7.3834 9.0776 2.6596 11.1698 11.0319 5.6054 1.2422 3.1864 1.5159 15.2640 2.9454 1.8456 1.9328 1.9963 1.7258 1.4063 1.1812 1.1928 1.1133 1.3915 1.4777 1.0916 1.1130 5.9323 1.0595 1.1025 1.0564 1.0910 1.1125 1.1045
irintensity: 0.9553 0.0169 0.7045 13.0964 18.9674 0.0888 17.2451 40.5126 2.6412 77.3988 9.5399 4.3492 81.1947 12.3245 27.0576 47.0973 46.7378 5.0505 0.5833 0.4654 2.2739 0.9095 12.8051 15.2549 9.6663 10.0962 3.3274 13.6052 7.0501 1.9862 5.3731 0.2661 5.8082
temp: 298.150 k
press: 1.00000 atm
elementType: 16 8 8 6 6 6 6 1 1 1 1 1 1
symmnumber: 1
zpe: 245566.0 jmol-1
zpe.correction: 0.093531 hartree
zpe.thermalcorrener: 0.100983 hartree
zpe.thermalcorrenthalpy: 0.101927 hartree
zpe.thermalcorrgfe: 0.060619 hartree
zpe.sumelectzpe: -703.793476 hartree
zpe.sumelectthermal: -703.786025 hartree
zpe.sumelectthermalent: -703.785080 hartree
zpe.sumelectthermalfe: -703.826388 hartree
dipole: 6.9721 -0.2288 -0.0284
dipole: 6.9759
quadrupole: -51.8414 -41.5092 -57.5622
quadrupole: -0.5768 -0.0128 -0.0569
quadrupole: -1.5371 8.7951 -7.2580 -0.5768 -0.0128 -0.0569
hfenergy: -703.8870072 hartree
pointgroup: C01 [X(C4H6O2S1)]
dipole: -2.735658 0.2206748 -0.0001887 debye
dipolederiv: 1.4835317 -0.0904646 0.0074337 0.131766 1.0758126 0.0216317 -0.015663 0.0239903 1.3058843 -0.6455753 0.0163137 -0.0383654 -0.0607886 -0.5065343 -0.0092624 -0.1941007 0.0164931 -0.6641928 -0.6422306 0.023571 0.0348005 -0.0178128 -0.5149114 -0.0215082 0.202346 -0.0489928 -0.6593816 -0.1379881 0.0973986 -0.0091128 0.0405708 -0.1581513 0.0114191 -0.0033527 0.0107106 -0.0566777 0.0019657 0.0188566 0.0004063 0.1328648 -0.1638388 0.0312348 -0.0122998 0.0323157 0.1492874 -0.2075891 0.148733 -0.0175437 0.031191 -0.1365334 -0.0260193 -0.0034016 -0.0276104 -0.3770885 0.0122445 -0.1012828 0.0086263 -0.2411941 0.1016123 -0.0204587 0.0215871 -0.0218717 -0.1304062 0.0432555 0.0180173 0.0091384 0.0011332 0.0510533 0.0521917 0.0396544 0.0528218 0.0115637 0.0435857 0.0122708 -0.0130826 -0.0111683 0.0244223 -0.055202 -0.039153 -0.056539 0.0399233 0.0038947 0.0088469 -0.0747007 0.0260648 0.079985 0.0219493 -0.1002992 0.0386024 -0.0112179 0.012953 0.0198293 0.0697148 0.0467848 0.0620213 -0.0397136 0.0923164 -0.0551872 -0.0032634 0.0541346 -0.0544176 0.0076413 -0.0317387 0.0297624 0.0193893 0.0048722 0.0196983 0.2107985 -0.0221823 -0.1176721 0.0150439 -0.0476727 0.0552998 0.0143483 0.0074938 0.0155689 0.1847708 unknown
polarizability: 86.7079519|-3.6855605|63.4643906|0.0131125|-0.3902343|59.4411339 unknown
InChI: InChI=1S/C4H6O2S/c5-7(6)3-1-2-4-7/h1,3H,2,4H2
charge 0 multiplicity 1
13 atoms
S  0.951488 -0.022139 -0.057855
O  1.779174 0.115684 1.344155
O  1.761743 -0.184088 -1.467843
C  -0.405168 1.406148 -0.204144
C  -1.773517 0.712771 -0.099163
C  -0.385153 -1.345081 0.094621
C  -1.614788 -0.800881 0.054126
H  -0.194826 1.86199 -1.180928
H  -0.164933 2.079523 0.6295
H  -2.385202 0.911054 -0.998933
H  -2.343313 1.09402 0.768703
H  -0.050438 -2.377011 0.198541
H  -2.521266 -1.41319 0.129721
