program: Gaussian 09
title: 000120874
version: EM64L-G09RevD.01
frameworkgroup: C1[X(C20H25NO2)]
method: RPBEPBE
basis: SDD
operation: Freq
keyword: #p
keyword: freq=noraman
keyword: PBEPBE/SDD
title: #p freq=noraman PBEPBE/SDD
converged: YES YES NO NO
title: Mulliken charges:
elementType: O O N C C C C C C C C C C C C C C C C C C C C H H H H H H H H H H H H H H H H H H H H H H H H H
charge: -0.242514 -0.488418 -0.168749 -0.053013 -0.468259 -0.423068 -0.331191 -0.330463 -0.341105 -0.325022 -0.314694 0.454254 0.444383 -0.441168 -0.397618 -0.398386 -0.418081 -0.240153 -0.236134 -0.230311 -0.252476 -0.248932 -0.245732 0.221982 0.214195 0.200894 0.223394 0.203151 0.265392 0.229326 0.204233 0.201463 0.218732 0.220931 0.193093 0.192941 0.218683 0.354702 0.268214 0.237719 0.247778 0.239905 0.223349 0.222996 0.221535 0.220935 0.225357 0.225947
chargesum: 0.00000
title: Mulliken charges with hydrogens summed into heavy atoms:
elementType: O O N C C C C C C C C C C C C C C C C C C C C
charge: -0.242514 -0.133716 -0.168749 0.168969 -0.053170 0.003478 -0.065800 0.103096 0.079090 0.089003 0.096929 0.454254 0.444383 -0.172954 -0.159899 -0.150607 -0.178175 -0.016803 -0.013137 -0.008775 -0.031541 -0.023575 -0.019784
polarizability: 2.53110124e+02 1.96611586e+01 2.30226227e+02 1.05250246e+01 1.23890506e+01 1.79064569e+02
1716.lowfreq: -15.9974 -3.0519 -1.3792 -0.0004 0.0002 0.0004 14.2342 15.8963 31.3832
frequency: 3.7178 15.7448 31.2293 38.3458 51.1703 60.1163 73.3464 78.3669 100.0922 149.6645 171.6312 196.1802 218.2139 229.4780 240.3194 276.0006 296.1783 321.5835 337.9124 400.0262 402.4384 405.6830 408.1225 444.0489 467.2507 469.4728 477.7700 539.0616 551.4221 590.0552 608.0957 614.7004 618.8602 635.1717 674.2917 703.8659 709.3707 732.2081 762.2731 765.6889 787.7568 805.7758 830.3998 839.5316 848.8182 853.0807 860.3068 895.9467 911.3793 925.9942 934.4243 976.1918 981.3732 985.6230 991.2032 991.6162 993.4086 995.3461 1009.7286 1024.4682 1027.7236 1030.7205 1042.1733 1052.1854 1055.8253 1078.2858 1080.9252 1089.3158 1096.0858 1107.0233 1121.0663 1135.6295 1170.1504 1171.5882 1183.5796 1188.9093 1190.4382 1192.5975 1193.9835 1212.6404 1224.1033 1248.8513 1263.1215 1275.5064 1281.4083 1292.7124 1293.4130 1307.8433 1320.6476 1329.7165 1337.6600 1338.9162 1346.2707 1355.7892 1370.9141 1375.9890 1378.2024 1385.2058 1404.7033 1436.0856 1440.8693 1442.9679 1445.4454 1447.9214 1452.7689 1455.8130 1466.9687 1480.9643 1484.7996 1589.1510 1592.9122 1609.2115 1614.8166 2897.0371 2901.5429 2915.0324 2938.6332 2952.4059 2956.6923 2967.7044 3006.5898 3029.2195 3037.4029 3040.6664 3045.5524 3084.0422 3087.1515 3115.2186 3115.9068 3119.5388 3121.3533 3132.1030 3135.3578 3141.0114 3144.8056 3158.7440 3161.1446 3265.5075
redmass: 4.0328 3.6394 3.8084 5.1545 3.7213 4.8881 5.3724 4.5961 4.4036 4.0644 3.6072 4.2932 4.4127 4.4476 1.8184 3.6818 4.0795 2.3923 2.6570 3.5356 2.8083 2.6669 2.3815 3.3580 3.4768 2.7091 3.2498 3.2457 2.9578 3.5110 2.1221 5.9545 6.1739 4.4130 1.0806 1.7347 1.7404 2.8650 3.1764 1.7860 2.4432 3.7784 3.5190 1.6058 3.1438 1.3123 1.2521 2.2163 1.5634 1.5052 1.6174 1.3890 1.5542 3.4963 4.1724 3.9022 1.3628 1.3496 3.0636 2.2009 2.2570 2.1657 2.3663 1.9533 2.5037 2.5460 1.6902 3.7009 1.9731 2.1572 2.6670 2.1184 1.0604 1.0549 1.5990 1.4729 1.0648 1.2409 1.5546 1.8281 1.2846 1.2675 1.3910 1.3015 1.2768 1.3027 1.2954 1.3553 1.3329 1.2089 1.2499 1.1977 1.3423 1.3734 1.2721 1.4391 6.4329 6.1956 1.6592 2.0035 1.1837 2.0671 1.0823 1.0870 1.0918 1.0898 1.1023 2.2182 2.2584 6.0388 5.9550 5.9745 6.0288 1.0692 1.0689 1.0675 1.0820 1.0671 1.0670 1.0591 1.0828 1.0950 1.0932 1.0986 1.0917 1.0957 1.0974 1.0847 1.0856 1.0873 1.0867 1.0919 1.0917 1.0962 1.0957 1.1014 1.1015 1.0638
irintensity: 0.2185 0.0822 0.3571 0.4737 0.6791 0.0754 1.2172 5.3219 2.7856 2.3456 1.0509 1.8500 0.9039 0.4863 0.7445 0.4474 0.3457 18.0681 4.7422 2.1581 0.2655 0.6765 3.5832 5.8135 5.0406 1.2986 4.4293 1.5644 12.5248 13.6274 20.9373 0.3575 0.8930 2.6151 72.8792 52.1799 59.2191 15.4800 26.5047 35.5415 17.3598 30.6921 16.9851 0.2139 5.9310 0.3366 0.6127 12.4244 11.3421 1.6671 3.3657 0.1210 0.4111 8.0907 0.8745 3.7925 0.5844 1.4236 22.8814 11.4916 16.2062 0.3319 4.0820 28.2245 15.7310 28.8616 0.5499 59.7360 10.6671 4.3147 39.3886 27.3395 0.0688 0.0661 0.3524 1.2833 1.0127 0.6129 2.0067 8.2779 10.4950 3.7273 19.0659 24.4398 7.8269 5.0316 3.2227 39.4085 10.5658 13.5472 3.7007 8.9876 0.8025 2.6176 4.8188 1.6481 1.0778 0.2417 58.5603 10.4059 6.8496 3.5373 3.3003 0.5344 16.3713 7.3844 14.2290 23.9082 19.8139 3.0544 0.3086 14.6959 8.3764 45.6791 52.2680 79.8327 37.9383 24.3634 106.1037 26.5483 2.8605 2.5460 10.0585 87.6345 29.8734 37.3391 34.3551 3.6691 5.7752 0.4528 0.3036 10.4539 18.9733 36.9374 47.2169 32.6542 25.3095 210.0591
temp: 298.150 k
press: 1.00000 atm
elementType: 8 8 7 6 6 6 6 6 6 6 6 6 6 6 6 6 6 6 6 6 6 6 6 1 1 1 1 1 1 1 1 1 1 1 1 1 1 1 1 1 1 1 1 1 1 1 1 1
symmnumber: 1
zpe: 1066437.5 jmol-1
zpe.correction: 0.406185 hartree
zpe.thermalcorrener: 0.427326 hartree
zpe.thermalcorrenthalpy: 0.428270 hartree
zpe.thermalcorrgfe: 0.351285 hartree
zpe.sumelectzpe: -980.582189 hartree
zpe.sumelectthermal: -980.561048 hartree
zpe.sumelectthermalent: -980.560103 hartree
zpe.sumelectthermalfe: -980.637089 hartree
dipole: 0.8425 -0.6499 -1.8144
dipole: 2.1034
quadrupole: -144.9876 -128.6782 -134.9296
quadrupole: -2.2836 1.7513 4.0818
quadrupole: -8.7891 7.5202 1.2688 -2.2836 1.7513 4.0818
hfenergy: -980.988374 hartree
pointgroup: C01 [X(C20H25N1O2)]
dipole: 0.3769932 0.2463626 0.6942727 debye
polarizability: 251.3646894|-18.7089555|229.9983332|-15.3352504|14.2490641|181.0378978 unknown
InChI: InChI=1S/C20H25NO2/c22-19(16-21-11-13-23-14-12-21)15-20(17-7-3-1-4-8-17)18-9-5-2-6-10-18/h1-10,19-20,22H,11-16H2
charge 0 multiplicity 1
48 atoms
O  6.384221 0.081822 -0.480339
O  1.291917 0.56798 -1.43867
N  3.592308 0.753487 -0.039851
C  1.146442 0.382639 0.013015
C  -0.208248 0.954528 0.452214
C  2.343969 1.086537 0.700738
C  -1.401564 0.317482 -0.319588
C  4.121264 -0.603893 0.280136
C  4.664643 1.776439 0.101379
C  5.320638 -0.925831 -0.625129
C  5.850894 1.414771 -0.807339
C  -1.493993 -1.194048 -0.046617
C  -2.738318 1.026533 -0.062694
C  -0.860507 -2.112084 -0.923896
C  -3.816283 0.790932 -0.958009
C  -2.172954 -1.701006 1.091422
C  -2.96148 1.89712 1.033579
C  -0.903122 -3.502245 -0.6710
C  -5.072589 1.403227 -0.768706
C  -2.214097 -3.089714 1.348712
C  -4.220219 2.5138 1.229682
C  -1.579661 -3.997095 0.467902
C  -5.281499 2.270197 0.330643
H  1.170775 -0.704583 0.244639
H  -0.208128 2.046341 0.264606
H  -0.323344 0.792834 1.543646
H  2.199761 2.181649 0.632648
H  2.397063 0.80874 1.778953
H  -1.15628 0.440872 -1.392099
H  3.325374 -1.352775 0.115932
H  4.436241 -0.661431 1.349566
H  5.02169 1.845709 1.156933
H  4.258299 2.762442 -0.191501
H  5.783332 -1.885755 -0.343363
H  4.987191 -0.970573 -1.684755
H  5.527232 1.438896 -1.870663
H  6.69102 2.113127 -0.660527
H  2.2896 0.646492 -1.560644
H  -0.326286 -1.725048 -1.800606
H  -3.663202 0.115672 -1.809161
H  -2.688645 -1.006418 1.765339
H  -2.153201 2.107234 1.742344
H  -0.413166 -4.197348 -1.362903
H  -5.887056 1.207853 -1.475755
H  -2.747967 -3.465231 2.229583
H  -4.369282 3.184676 2.08387
H  -1.618338 -5.074872 0.663331
H  -6.255843 2.74872 0.481002
