program: Gaussian 09
title: 000120873
version: EM64L-G09RevD.01
frameworkgroup: C1[X(C21H25NO)]
method: RPBEPBE
basis: SDD
operation: Freq
keyword: #p
keyword: freq=noraman
keyword: PBEPBE/SDD
title: #p freq=noraman PBEPBE/SDD
converged: NO YES NO NO
title: Mulliken charges:
elementType: O N C C C C C C C C C C C C C C C C C C C C C H H H H H H H H H H H H H H H H H H H H H H H H H
charge: -0.476948 -0.157693 -0.348273 -0.360476 -0.401349 -0.390323 -0.397697 -0.428894 -0.136979 -0.326909 0.262854 0.284737 0.236671 -0.416030 -0.409848 -0.391913 -0.394402 -0.234018 -0.255425 -0.227858 -0.237849 -0.247508 -0.247045 0.229888 0.183868 0.179179 0.220333 0.207094 0.199079 0.197166 0.206315 0.191015 0.218365 0.211849 0.222292 0.221649 0.232321 0.352007 0.243795 0.318755 0.258132 0.253845 0.223569 0.227412 0.225858 0.224882 0.227970 0.226538
chargesum: 0.00000
title: Mulliken charges with hydrogens summed into heavy atoms:
elementType: O N C C C C C C C C C C C C C C C C C C C C C
charge: -0.124941 -0.157693 0.065483 0.039036 0.004824 0.013157 0.011683 0.005246 0.084670 -0.094588 0.262854 0.284737 0.236671 -0.172235 -0.091093 -0.133781 -0.140557 -0.010449 -0.028013 -0.002000 -0.012967 -0.019537 -0.020507
polarizability: 3.05534295e+02 8.50153428e+00 2.63646448e+02 1.23128934e+01 1.06202838e+01 1.59394596e+02
1716.lowfreq: -15.9599 -5.5312 -2.7105 -0.0008 -0.0006 -0.0004 15.6636 28.9814 37.4587
frequency: 11.7269 28.8344 37.3175 48.7447 65.5021 71.4325 77.0645 93.3860 99.3462 168.1189 177.6053 210.1241 222.2607 228.4976 236.4840 290.8565 310.4030 332.5129 349.5556 397.7988 405.1292 410.0515 423.7835 438.8657 449.0517 470.9926 484.7843 539.9559 565.1182 602.4009 611.9220 616.0908 639.7091 647.9453 702.5893 709.4577 713.6592 721.1535 758.7820 777.9050 782.3303 801.9198 831.2877 850.5305 852.3738 852.8327 862.5661 865.0454 894.3197 911.0550 926.5303 941.1504 955.3418 977.2786 984.8904 987.0010 988.7615 989.5423 994.2405 1003.7758 1013.6638 1023.4048 1028.0506 1032.7283 1049.4908 1068.7141 1083.0406 1087.3636 1101.6962 1109.1605 1122.7412 1147.7003 1153.6136 1164.6632 1171.6748 1172.7243 1185.2557 1192.2650 1202.5190 1247.1445 1255.1814 1263.7311 1269.9996 1283.6338 1292.5143 1304.2334 1314.3699 1318.8401 1328.9324 1333.2639 1340.3818 1350.3439 1353.0698 1361.6142 1372.4262 1376.0685 1379.2317 1400.2863 1433.6625 1435.5784 1451.4997 1453.7198 1462.4087 1467.9935 1469.2073 1479.3963 1481.3907 1488.1538 1577.4160 1580.3674 1607.3539 1609.6781 1622.6017 2861.2391 2867.3280 2920.3520 2954.8849 2969.4279 2985.2950 2987.4717 3028.8591 3034.9418 3037.0429 3040.8347 3046.9766 3055.9213 3096.8883 3119.3114 3120.4313 3125.2874 3127.6906 3135.7737 3140.4461 3145.9010 3149.3309 3160.9305 3163.7514 3172.1098
redmass: 3.6888 3.8819 4.0540 3.6487 4.2218 4.1022 4.2459 6.0186 4.0109 4.3223 3.2893 4.6973 4.2798 2.6467 2.5488 4.8669 2.0322 3.5522 2.7615 2.0202 2.8540 2.9079 3.2707 4.1402 2.8617 3.1624 3.2040 2.4307 2.9619 3.3658 5.5698 6.3486 3.9317 4.3634 1.7363 1.7690 1.1031 3.4260 2.7389 2.1994 2.2070 1.4759 2.8205 2.2541 1.3763 1.4807 1.5606 1.2865 3.1238 2.6437 1.4895 1.4643 1.3074 1.4036 2.5800 2.8706 4.1140 1.9808 1.3253 1.5246 2.3589 2.6693 2.3608 2.1310 2.1665 1.8488 1.5910 1.6564 2.5515 2.0916 2.4914 1.5616 1.7926 2.0540 1.0545 1.0645 1.4744 1.1333 1.1395 1.4404 1.8887 1.2376 1.2759 1.2534 1.3192 1.2503 1.3381 1.3293 1.3440 1.3651 1.4270 1.4925 1.5366 1.6437 4.9957 4.2048 1.4496 1.6758 2.3106 2.2512 1.0880 1.0928 1.0865 1.0892 1.0856 2.0951 1.1289 2.3024 5.6165 5.8509 5.9664 5.8278 7.9151 1.0709 1.0698 1.0668 1.0827 1.0632 1.0614 1.0615 1.0910 1.0941 1.0927 1.0912 1.1032 1.1038 1.0889 1.0852 1.0846 1.0885 1.0873 1.0928 1.0925 1.0961 1.0959 1.1012 1.1014 1.0638
irintensity: 0.2384 0.6964 0.3882 0.2378 0.3011 0.2602 1.6944 2.5397 1.9058 0.1883 3.2185 1.2556 0.6753 0.2452 0.7185 0.0890 8.9355 1.1467 1.1996 8.6634 0.3204 0.2200 0.0656 3.4093 0.2385 5.1453 5.3717 10.0150 6.1857 13.4485 3.8372 0.6102 14.2096 1.1138 46.5307 55.9439 72.5816 4.3329 27.3288 46.4564 23.2935 0.8557 12.6301 3.4389 8.4567 11.4417 17.1863 7.0772 3.3623 1.5065 0.9680 6.3562 4.0988 0.6960 3.8846 16.6870 2.5528 1.5108 0.1169 8.8170 42.3280 21.9016 11.7798 5.0177 8.1800 21.9362 4.7293 5.7071 44.3108 6.3033 7.1910 5.4142 21.4440 7.5782 0.0326 0.1484 22.9579 1.6093 1.0059 17.7896 2.6659 1.7350 16.6531 15.4522 2.0214 30.7847 26.7230 26.7203 4.9902 2.8436 0.1713 2.7033 21.1265 5.7964 3.2409 10.4175 4.6647 85.7808 11.5977 4.2015 11.4778 4.3579 13.1911 10.6518 7.5637 16.5858 9.6127 14.2526 1.6895 2.5785 3.9023 0.7313 14.1478 36.9802 131.0696 57.3591 34.1590 41.3286 31.6647 25.8070 14.4046 65.2819 73.3924 14.9298 18.0332 94.6879 22.6516 3.7835 3.0177 12.9442 0.8924 8.3009 20.6121 32.6906 33.0875 46.7946 31.0494 308.6818
temp: 298.150 k
press: 1.00000 atm
elementType: 8 7 6 6 6 6 6 6 6 6 6 6 6 6 6 6 6 6 6 6 6 6 6 1 1 1 1 1 1 1 1 1 1 1 1 1 1 1 1 1 1 1 1 1 1 1 1 1
symmnumber: 1
zpe: 1069008.6 jmol-1
zpe.correction: 0.407164 hartree
zpe.thermalcorrener: 0.427982 hartree
zpe.thermalcorrenthalpy: 0.428926 hartree
zpe.thermalcorrgfe: 0.354971 hartree
zpe.sumelectzpe: -943.496221 hartree
zpe.sumelectthermal: -943.475403 hartree
zpe.sumelectthermalent: -943.474459 hartree
zpe.sumelectthermalfe: -943.548414 hartree
dipole: 2.3304 -0.7552 -2.4515
dipole: 3.4657
quadrupole: -116.7930 -126.1698 -142.5350
quadrupole: -1.5705 -1.0595 2.6737
quadrupole: 11.7063 2.3295 -14.0358 -1.5705 -1.0595 2.6737
hfenergy: -943.903385 hartree
pointgroup: C01 [X(C21H25N1O1)]
dipole: 0.9354324 0.1887697 0.9739069 debye
polarizability: 305.0981418|-1.7023979|256.0251241|-19.877528|27.117101|167.4520736 unknown
InChI: InChI=1S/C21H25NO/c23-20(17-22-14-8-3-9-15-22)16-21(18-10-4-1-5-11-18)19-12-6-2-7-13-19/h1-2,4-7,10-13,16,20,23H,3,8-9,14-15,17H2
charge 0 multiplicity 1
48 atoms
O  1.488011 0.347363 -1.590656
N  3.472011 0.926983 0.10403
C  4.046198 -0.318676 0.687771
C  4.406287 2.07897 0.231664
C  5.381689 -0.685381 0.010377
C  5.74939 1.778645 -0.463599
C  6.385663 0.487014 0.100579
C  2.10028 1.217449 0.605424
C  1.078683 0.333418 -0.167176
C  -0.328487 0.854425 -0.033684
C  -1.472665 0.097338 0.033664
C  -2.789935 0.775941 0.261009
C  -1.47152 -1.390279 -0.14105
C  -2.894385 1.90334 1.123672
C  -0.681735 -2.01123 -1.150723
C  -3.96829 0.324556 -0.396748
C  -2.284534 -2.214633 0.687471
C  -4.12563 2.568585 1.305456
C  -0.700498 -3.414101 -1.31286
C  -5.199706 0.990361 -0.217478
C  -2.294355 -3.616536 0.528316
C  -5.285354 2.117228 0.633116
C  -1.502379 -4.223624 -0.475125
H  3.315597 -1.136433 0.554448
H  4.207196 -0.190317 1.788107
H  4.595389 2.31926 1.308763
H  3.926633 2.963234 -0.22689
H  5.188366 -0.928552 -1.052555
H  5.796293 -1.593329 0.488527
H  6.43059 2.640791 -0.330392
H  5.570186 1.659652 -1.550007
H  6.667536 0.649298 1.16179
H  7.31586 0.243543 -0.446267
H  1.997261 1.059782 1.703268
H  1.882624 2.280365 0.388166
H  1.127979 -0.710002 0.209258
H  -0.428672 1.949079 -0.022258
H  2.484548 0.523503 -1.523255
H  -2.007863 2.239792 1.673398
H  -0.06852 -1.385913 -1.810607
H  -3.910128 -0.542368 -1.06368
H  -2.904154 -1.750428 1.46312
H  -4.184066 3.430296 1.980315
H  -0.093277 -3.873688 -2.101129
H  -6.091675 0.632174 -0.743926
H  -2.919969 -4.234295 1.182736
H  -6.242718 2.630798 0.776309
H  -1.516657 -5.311698 -0.606388
