program: Gaussian 09
title: 000120892
version: EM64L-G09RevD.01
frameworkgroup: C1[X(C16H24N2O4)]
method: RPBEPBE
basis: SDD
operation: Freq
keyword: #p
keyword: freq=noraman
keyword: PBEPBE/SDD
title: #p freq=noraman PBEPBE/SDD
converged: YES YES NO NO
title: Mulliken charges:
elementType: O O O O N N C C C C C C C C C C C C C C C C H H H H H H H H H H H H H H H H H H H H H H H H
charge: -0.295702 -0.303671 -0.296211 -0.310398 -0.455811 -0.509813 -0.023265 -0.419102 -0.454563 -0.402840 -0.407788 -0.376675 0.278116 0.601646 -0.696971 -0.550255 0.335089 0.305070 0.005811 -0.527548 -0.526194 -0.523779 0.258233 0.193599 0.242330 0.203371 0.216900 0.205166 0.196782 0.174768 0.210272 0.201786 0.194895 0.281527 0.291749 0.242892 0.330755 0.227040 0.251030 0.221815 0.212164 0.264796 0.225709 0.254076 0.229933 0.223267
chargesum: 0.00000
title: Mulliken charges with hydrogens summed into heavy atoms:
elementType: O O O O N N C C C C C C C C C C C C C C C C
charge: -0.295702 -0.303671 -0.296211 -0.310398 -0.174284 -0.218065 0.234968 0.016827 -0.034292 -0.000891 -0.022748 0.020006 0.278116 0.601646 -0.454079 -0.219500 0.335089 0.305070 0.005811 0.172337 0.176474 0.183497
polarizability: 3.02925014e+02 -5.77877573e-01 2.01687401e+02 4.85910995e+00 -1.19975926e+00 1.37487575e+02
1716.lowfreq: -6.4562 0.0001 0.0005 0.0007 4.1878 4.6612 27.3755 37.4004 46.8975
frequency: 26.0787 35.3369 46.4643 52.9860 64.0268 67.0528 81.3459 89.3204 97.7554 115.8681 140.4249 149.8471 159.5201 162.8433 191.4206 200.5239 215.0178 222.5924 234.4585 252.5694 285.2064 292.6074 317.4743 324.3793 333.7793 369.8880 384.1826 398.0754 439.2430 464.4258 479.1483 481.2932 515.4663 565.8446 588.3297 594.5865 631.7149 640.9304 651.0581 706.3244 719.4590 763.3920 770.2139 778.9552 802.6311 839.4165 850.1525 862.9536 869.1009 874.7175 908.3327 917.4040 927.2923 938.8260 967.5362 996.8221 1012.4128 1036.0441 1043.2315 1050.4093 1061.6616 1090.9321 1111.4203 1113.2834 1113.5442 1113.8580 1130.0300 1148.7181 1152.3263 1156.5201 1160.0834 1164.7149 1186.7282 1200.1026 1209.4986 1245.4452 1258.1357 1273.7333 1302.5261 1317.9696 1327.0816 1332.6719 1338.8046 1349.3528 1355.2403 1359.0666 1371.3785 1395.9762 1416.5449 1429.0354 1436.6759 1454.2908 1456.7526 1457.5439 1458.8241 1461.5224 1465.5924 1471.6978 1473.5605 1475.1790 1476.8181 1484.1849 1487.4299 1488.4735 1506.9466 1581.5007 1616.3758 1638.9924 2946.0836 2967.1839 2970.4896 2970.7352 2971.5331 2973.8389 2978.7177 2983.8800 3025.1858 3028.5019 3032.1329 3038.0450 3044.6833 3055.3848 3068.3089 3073.8156 3078.5420 3116.3929 3118.3257 3123.9094 3137.7008 3204.4743 3528.8324 3545.7293
redmass: 4.6358 3.7997 4.9202 3.5964 3.6443 3.6739 3.1715 3.0953 2.9005 3.6243 1.7625 1.2072 1.3937 1.2041 4.3259 2.4403 2.8668 3.5202 3.3554 3.8947 5.7878 5.3553 2.1258 2.8037 2.0061 4.9962 2.5673 2.4281 4.7798 2.8363 3.4106 3.1621 5.0615 1.3569 5.3143 3.8927 3.1644 3.2216 3.4794 9.5063 5.4633 3.8392 4.6722 1.5000 3.5519 1.7726 1.8810 2.4414 2.9404 3.1981 4.5326 1.6328 1.4230 9.0063 2.9771 4.1617 2.8631 3.8286 2.1724 1.5840 2.0302 1.6973 1.2417 1.0437 1.2364 1.2376 2.9453 1.4901 1.6762 1.5439 1.4881 2.3272 1.9419 1.4799 1.6474 1.3488 1.3001 1.3246 1.6945 2.9380 1.5794 1.4434 1.4252 1.5166 1.5390 3.4093 1.4538 3.3899 1.2163 1.2888 1.2556 1.1250 1.0958 1.1960 1.0798 1.3132 1.1373 2.0955 1.1443 1.1060 1.1460 1.0630 1.1305 1.0733 2.4582 5.6829 6.7520 4.4365 1.0677 1.0624 1.0313 1.0636 1.0332 1.0299 1.0637 1.0620 1.0915 1.0940 1.0908 1.0999 1.1017 1.0996 1.1036 1.1054 1.0986 1.1032 1.1027 1.1044 1.0918 1.0926 1.0763 1.0770
irintensity: 1.5426 0.7290 8.6509 3.7747 2.9624 0.4827 1.3962 3.9526 13.3404 1.3616 1.7741 0.7158 0.9398 0.5835 6.5071 0.5532 1.5284 10.5979 0.4876 6.7574 13.2394 9.6738 6.2770 5.3110 15.5348 6.6585 4.0295 8.5579 0.2600 2.4074 1.3793 3.6787 0.3531 121.1290 7.1599 41.5943 4.4184 7.2978 5.2542 10.1253 4.3840 9.3171 13.0762 0.8456 1.5777 4.5489 25.4479 10.6425 12.4717 9.4729 18.9340 57.3155 6.9855 63.7080 11.1485 47.3818 34.4042 135.9371 35.8670 9.6657 2.8073 2.0129 6.1529 1.6339 8.0119 11.6980 28.4536 9.8372 9.6643 0.9085 12.6500 20.9667 54.0475 334.5905 74.4859 29.6870 17.1821 24.0187 15.7754 85.5027 37.7291 30.4482 2.9520 3.7593 5.5065 49.4265 13.0858 52.6606 15.2800 12.0159 28.2915 112.4888 98.8448 140.9895 29.8355 299.3241 87.4009 96.7039 14.4948 28.6512 5.5350 35.3379 31.5940 8.1071 448.5695 178.9421 182.6782 166.1919 37.8263 39.6001 58.3859 24.3730 129.7155 54.7795 23.7158 29.1761 71.5305 78.3493 12.6299 42.1833 68.3816 60.2317 27.4542 21.3901 33.6117 29.0683 25.5061 17.4238 7.6379 18.4168 5.2492 29.8770
temp: 298.150 k
press: 1.00000 atm
elementType: 8 8 8 8 7 7 6 6 6 6 6 6 6 6 6 6 6 6 6 6 6 6 1 1 1 1 1 1 1 1 1 1 1 1 1 1 1 1 1 1 1 1 1 1 1 1
symmnumber: 1
zpe: 1005221.3 jmol-1
zpe.correction: 0.382869 hartree
zpe.thermalcorrener: 0.406433 hartree
zpe.thermalcorrenthalpy: 0.407377 hartree
zpe.thermalcorrgfe: 0.328689 hartree
zpe.sumelectzpe: -1032.775333 hartree
zpe.sumelectthermal: -1032.751768 hartree
zpe.sumelectthermalent: -1032.750824 hartree
zpe.sumelectthermalfe: -1032.829512 hartree
dipole: -1.5596 3.0460 0.8871
dipole: 3.5352
quadrupole: -101.1806 -132.0974 -129.9807
quadrupole: -8.8459 4.8859 -1.0970
quadrupole: 19.9056 -11.0112 -8.8945 -8.8459 4.8859 -1.0970
hfenergy: -1033.1582014 hartree
pointgroup: C01 [X(C16H24N2O4)]
dipole: -0.5973559 1.1949305 0.3869748 debye
polarizability: 303.059037|-1.1145534|201.7175567|0.0574555|-0.0863803|137.3233966 unknown
InChI: InChI=1S/C16H24N2O4/c1-20-13-9-12(10-14(21-2)15(13)22-3)18-16(19)17-11-7-5-4-6-8-11/h9-11,17-18H,4-8H2,1-3H3
charge 0 multiplicity 1
46 atoms
O  -1.594339 -1.620093 -0.356504
O  3.165063 -2.36402 -0.295466
O  3.636758 2.565234 -0.209364
O  4.895108 -0.0579 -0.239109
N  -3.05837 0.189042 -0.506913
N  -0.752001 0.592664 -0.374743
C  -4.260626 -0.674933 -0.55127
C  -4.728349 -1.088366 0.871782
C  -5.397577 0.041928 -1.319877
C  -5.32191 0.100404 1.663032
C  -6.003017 1.22886 -0.527198
C  -6.470059 0.782552 0.879693
C  -1.785073 -0.366402 -0.406166
C  0.648116 0.363408 -0.301425
C  1.485193 1.507452 -0.226304
C  1.224889 -0.93256 -0.288709
C  2.626514 -1.056717 -0.233909
C  2.888041 1.372097 -0.183704
C  3.482157 0.080113 -0.213596
C  3.977958 -2.76225 0.876025
C  4.684701 2.712918 0.8253
C  5.410255 -0.505402 -1.557356
H  -3.958084 -1.587894 -1.095982
H  -5.498393 -1.879836 0.763469
H  -3.875413 -1.540428 1.409546
H  -6.197601 -0.70125 -1.506866
H  -5.029167 0.374638 -2.309515
H  -5.68684 -0.248505 2.647984
H  -4.523773 0.843488 1.869484
H  -5.257455 2.047324 -0.421779
H  -6.848489 1.661358 -1.095733
H  -6.86188 1.649489 1.446059
H  -7.3096 0.065031 0.769137
H  -3.192447 1.200689 -0.530763
H  -1.024256 1.576944 -0.409848
H  1.071399 2.522143 -0.211071
H  0.597983 -1.824013 -0.321745
H  4.339158 -3.776778 0.647659
H  4.827024 -2.070568 1.020903
H  3.346452 -2.784922 1.784628
H  4.223145 2.734908 1.831763
H  5.41753 1.891916 0.761478
H  5.161698 3.6819 0.612078
H  4.976454 -1.486043 -1.823557
H  5.167049 0.243306 -2.333898
H  6.501874 -0.586726 -1.437551
