program: Gaussian 09
title: 000120816
version: EM64L-G09RevD.01
frameworkgroup: C1[X(C22H31NO3)]
method: RPBEPBE
basis: SDD
operation: Freq
keyword: #p
keyword: freq=noraman
keyword: PBEPBE/SDD
title: #p freq=noraman PBEPBE/SDD
converged: YES YES NO NO
title: Mulliken charges:
elementType: O O O N C C C C C C C C C C C C C C C C C C C C C C H H H H H H H H H H H H H H H H H H H H H H H H H H H H H H H
charge: -0.468108 -0.291193 -0.272929 -0.101473 -0.030565 -0.489752 0.056871 0.274071 0.381890 -0.755560 -0.306369 -0.296869 0.167721 -0.494462 -0.363318 -0.417028 -0.724174 -0.715141 0.321770 -0.346989 -0.235606 -0.247160 -0.382957 -0.248046 -0.538323 -0.539274 0.236780 0.226532 0.190653 0.216583 0.223999 0.212328 0.166539 0.199203 0.172445 0.205543 0.344270 0.306255 0.262710 0.251951 0.253645 0.212418 0.209556 0.250559 0.202586 0.198356 0.235548 0.224825 0.222324 0.245948 0.227082 0.215487 0.223832 0.240157 0.219922 0.238209 0.226728
chargesum: 0.00000
title: Mulliken charges with hydrogens summed into heavy atoms:
elementType: O O O N C C C C C C C C C C C C C C C C C C C C C C
charge: -0.123838 -0.291193 -0.272929 -0.101473 0.206216 -0.072566 0.056871 0.274071 0.381890 -0.102650 0.059373 0.081119 0.167721 -0.188207 -0.100608 -0.165077 -0.048554 -0.063640 0.321770 -0.111441 -0.010781 -0.024837 -0.137010 -0.020964 0.141154 0.145585
polarizability: 2.86959702e+02 2.33336810e+01 2.46474287e+02 -1.53151951e+01 -8.27636306e+00 2.29275588e+02
1716.lowfreq: -9.1538 -0.0001 0.0004 0.0005 4.1464 6.3467 22.2786 24.7305 29.9990
frequency: 19.3458 24.0409 29.8714 51.1296 54.0153 61.2668 69.2503 75.6620 83.1746 90.3806 107.5328 117.7409 139.8404 143.1708 156.7613 167.4848 176.5063 197.9361 209.3613 221.0146 229.2514 245.4481 248.1524 261.8668 267.1157 275.8633 279.8336 293.6447 318.9309 326.7013 342.8672 362.7274 381.1617 394.1133 401.8980 425.2844 445.6234 468.0912 472.3360 508.0482 530.1128 542.9329 563.8180 592.9111 615.9253 619.9146 652.3995 669.8453 685.9019 703.3187 715.7117 739.7089 775.9007 783.0329 797.8093 801.4472 815.2855 842.1350 853.7608 867.1733 899.2815 915.9719 919.6398 923.6054 930.7475 938.7823 957.8406 979.8953 988.3857 990.7389 995.5865 1003.6011 1015.9575 1030.1222 1054.3527 1060.1381 1065.4111 1078.5994 1086.4235 1092.3737 1113.0499 1114.7219 1115.3623 1123.9609 1145.7794 1151.0770 1157.9213 1163.9962 1169.8535 1171.3858 1187.6830 1192.8822 1201.2300 1206.2889 1238.3479 1243.3132 1278.0287 1283.1871 1289.5798 1305.9673 1313.6621 1325.1757 1350.9569 1360.2448 1365.5559 1371.6027 1374.6044 1378.0916 1380.4661 1384.2782 1390.8020 1411.6726 1434.0252 1438.0018 1442.7420 1446.8151 1464.4926 1466.2868 1466.3533 1467.9079 1470.1996 1471.3881 1472.3803 1475.0595 1476.9082 1480.7516 1485.3640 1489.0924 1494.3829 1500.8659 1589.1622 1594.8810 1608.7240 1617.2495 2822.3545 2845.5785 2955.1044 2956.0735 2970.0797 2978.6147 2979.2569 2983.8399 3016.6142 3020.3386 3041.2897 3042.0276 3046.1748 3055.7324 3067.5221 3068.7723 3071.1253 3073.5952 3090.7947 3096.7008 3118.5629 3118.8425 3120.3584 3129.4505 3143.9296 3151.3459 3153.0744 3164.1060 3172.3527 3194.5629 3557.5959
redmass: 3.7430 4.0306 3.7995 3.7971 3.5104 2.8663 3.3048 2.7577 2.9612 2.2473 3.7267 2.5251 1.7720 2.3289 3.8501 3.2118 3.3663 1.4566 1.3925 1.4318 1.7301 1.2837 1.7099 3.2207 1.9722 1.8103 3.0497 3.1883 3.5534 2.2695 3.0777 3.6279 4.6453 3.0666 2.8657 4.7501 2.9333 4.0534 3.6466 2.9653 2.8689 3.1305 3.6017 3.9308 5.5794 4.5258 5.0764 5.8516 3.0162 1.6619 5.2065 4.0570 2.1166 1.2067 1.1896 1.4889 3.7792 2.6529 1.2654 2.0839 1.5152 1.9358 1.8426 1.3609 1.9228 1.8098 2.4262 1.3889 7.9554 6.0614 1.3207 5.8058 3.1576 2.2025 2.4718 2.0861 2.4385 1.9665 2.2265 1.9140 1.3261 1.3135 1.6873 1.7740 1.4944 2.5853 1.4439 1.6203 1.4447 1.0580 2.6624 1.1712 2.7309 2.4359 1.5764 3.9530 1.2480 1.2639 1.1909 1.2221 1.3950 1.4591 1.5172 1.3529 1.2581 1.2605 1.4294 5.5750 1.4096 4.2761 1.2508 2.5632 2.1680 1.1917 1.2003 1.2548 1.0504 1.0707 1.0596 1.0673 1.1095 1.0779 1.1016 1.0845 1.0515 2.0100 1.0564 1.0534 1.9313 1.0786 6.0653 8.2007 6.0672 6.6161 1.0723 1.0715 1.0329 1.0330 1.0357 1.0380 1.0618 1.0358 1.0848 1.0823 1.1037 1.1035 1.0879 1.0958 1.0985 1.0986 1.0958 1.0979 1.0998 1.1002 1.0993 1.0995 1.0844 1.0881 1.0926 1.0870 1.0952 1.1004 1.0964 1.0903 1.0662
irintensity: 0.3522 1.5116 0.3614 0.3020 2.5447 1.1322 0.5490 16.3033 1.1266 10.0900 0.3668 47.6153 23.9240 43.7411 5.5203 2.0280 2.5024 4.3433 0.5220 2.2442 4.5253 0.3164 4.2017 1.3258 0.0943 0.6895 0.6350 1.1679 6.5424 2.8741 3.6399 3.1369 0.3276 1.2374 0.1436 0.7067 6.7737 3.6110 1.1514 18.1937 4.9500 4.4455 7.5517 6.4433 2.2719 10.9928 2.0612 23.7270 4.9649 53.2594 22.1057 6.4526 50.6763 9.2523 1.3468 42.2707 21.7853 9.3569 1.0158 15.8188 21.4831 7.8434 4.3133 0.3259 2.6345 6.2421 12.7270 0.5743 25.4694 1.9184 0.1886 95.0502 22.8247 10.9117 5.7491 9.0538 10.1236 14.2891 5.9808 5.9773 2.7888 1.5057 8.1458 18.3841 17.7035 43.7467 17.5892 22.4705 2.1221 0.2666 43.3803 11.2626 183.0802 95.9817 18.5273 3.5782 7.6967 2.6016 12.6896 4.0026 20.3251 29.6550 20.5797 3.7510 10.1459 14.1380 4.1867 5.3108 9.0183 32.4176 12.2844 79.1675 16.2227 2.4046 1.9664 2.1576 13.8347 12.4640 22.1468 3.1367 48.1877 28.0108 113.0558 5.1603 4.0987 13.2053 0.3126 9.6947 79.0068 6.1784 1.0207 0.9733 7.7606 18.3071 101.1719 178.9351 129.1663 6.7356 29.5663 42.6670 34.2990 24.3064 24.9153 15.2167 41.8168 50.4629 6.7185 0.4174 14.6263 34.0131 101.6501 61.4231 26.1612 37.4079 24.3939 29.4017 0.8974 7.1036 22.8314 7.6188 33.7660 19.7740 11.5073 4.8810 6.1920
temp: 298.150 k
press: 1.00000 atm
elementType: 8 8 8 7 6 6 6 6 6 6 6 6 6 6 6 6 6 6 6 6 6 6 6 6 6 6 1 1 1 1 1 1 1 1 1 1 1 1 1 1 1 1 1 1 1 1 1 1 1 1 1 1 1 1 1 1 1
symmnumber: 1
zpe: 1265412.7 jmol-1
zpe.correction: 0.481970 hartree
zpe.thermalcorrener: 0.510401 hartree
zpe.thermalcorrenthalpy: 0.511345 hartree
zpe.thermalcorrgfe: 0.422351 hartree
zpe.sumelectzpe: -1135.317081 hartree
zpe.sumelectthermal: -1135.288650 hartree
zpe.sumelectthermalent: -1135.287706 hartree
zpe.sumelectthermalfe: -1135.376700 hartree
dipole: -1.5985 -1.0708 0.9981
dipole: 2.1675
quadrupole: -148.0754 -156.7779 -143.8473
quadrupole: -0.2019 -5.5847 0.9978
quadrupole: 1.4915 -7.2110 5.7196 -0.2019 -5.5847 0.9978
hfenergy: -1135.799051 hartree
pointgroup: C01 [X(C22H31N1O3)]
dipole: -0.5736197 -0.4004208 0.4876667 debye
polarizability: 281.0724877|23.4957535|247.1968735|-20.1148543|-13.6784523|234.4402167 unknown
InChI: InChI=1S/C22H31NO3/c1-6-23(7-2)17(3)16-22(24,18-11-9-8-10-12-18)20-15-19(25-4)13-14-21(20)26-5/h8-15,17,24H,6-7,16H2,1-5H3
charge 0 multiplicity 1
57 atoms
O  0.05187 -1.242186 -1.590531
O  -1.356965 0.670516 1.995245
O  1.86876 3.367797 -1.765792
N  2.554216 -1.44714 0.278056
C  1.517358 -1.475082 1.349785
C  0.072288 -1.74773 0.852083
C  -0.509416 -0.83046 -0.262116
C  -0.114392 0.643549 -0.068053
C  -2.048857 -0.970009 -0.403896
C  1.833627 -2.468922 2.510457
C  3.864859 -0.893065 0.709838
C  2.721211 -2.71489 -0.475957
C  -0.567136 1.379398 1.061193
C  0.700405 1.292177 -1.019587
C  -2.711738 -0.120832 -1.330603
C  -2.810835 -1.955518 0.270617
C  3.795783 0.522164 1.315043
C  3.226971 -2.488216 -1.915696
C  1.053159 2.65305 -0.8652
C  -0.222782 2.745053 1.210695
C  -4.095821 -0.245924 -1.569091
C  -4.198766 -2.085794 0.031339
C  0.585766 3.383225 0.249485
C  -4.848227 -1.232432 -0.887543
C  -1.984077 1.43695 3.071075
C  2.396691 2.628514 -2.913636
H  1.503462 -0.456202 1.778637
H  -0.565878 -1.62831 1.745815
H  -0.028506 -2.800115 0.51714
H  1.810395 -3.517488 2.158116
H  2.834139 -2.276654 2.93923
H  1.093716 -2.368263 3.326464
H  4.390931 -1.575495 1.42985
H  4.506625 -0.850504 -0.189925
H  3.407124 -3.425342 0.054041
H  1.736776 -3.209061 -0.540606
H  -0.522182 -1.975702 -1.928466
H  1.044231 0.693646 -1.864265
H  -2.128941 0.642899 -1.857324
H  -2.334797 -2.620215 0.997506
H  3.224852 1.198372 0.655126
H  3.322294 0.534937 2.313301
H  4.818516 0.926364 1.432121
H  2.522463 -1.820349 -2.439651
H  4.23329 -2.031559 -1.939521
H  3.286738 -3.449959 -2.460607
H  -0.575427 3.319884 2.072006
H  -4.588511 0.422727 -2.284323
H  -4.771745 -2.852318 0.56598
H  0.863406 4.436602 0.351767
H  -5.924199 -1.332357 -1.0703
H  -1.228406 1.862938 3.760702
H  -2.618076 2.25101 2.669044
H  -2.611036 0.71265 3.612523
H  1.581986 2.265169 -3.570525
H  3.019887 3.351946 -3.460626
H  3.01512 1.768055 -2.590638
