program: Gaussian 09
title: 000119535
version: EM64L-G09RevD.01
frameworkgroup: C1[X(C12H6Cl3NO2)]
method: RPBEPBE
basis: SDD
operation: Freq
keyword: #p
keyword: freq=noraman
keyword: PBEPBE/SDD
title: #p freq=noraman PBEPBE/SDD
converged: YES YES NO NO
title: Mulliken charges:
elementType: Cl Cl Cl O O N C C C C C C C C C C C C H H H H H H
charge: 0.016213 0.016269 -0.013274 -0.262838 -0.226343 -0.004235 0.525016 0.384540 -0.246352 -0.241895 -0.351444 -0.289723 -0.220770 -0.221571 -0.100312 -0.272907 -0.275149 0.133485 0.270046 0.259754 0.289933 0.290033 0.265959 0.275565
chargesum: 0.00000
title: Mulliken charges with hydrogens summed into heavy atoms:
elementType: Cl Cl Cl O O N C C C C C C C C C C C C
charge: 0.016213 0.016269 -0.013274 -0.262838 -0.226343 -0.004235 0.525016 0.384540 -0.246352 -0.241895 -0.081398 -0.029969 0.069163 0.068462 -0.100312 -0.006948 0.000416 0.133485
polarizability: 2.75299052e+02 -7.90753701e-01 1.42927186e+02 -6.27510945e+00 -2.36401638e+00 1.34166821e+02
1716.lowfreq: -1.3505 0.0017 0.0024 0.0028 6.4326 7.8638 13.8646 33.0602 37.1371
frequency: 13.7863 33.0555 37.1165 85.7293 88.9344 140.3454 164.2960 165.5048 176.2367 196.0237 212.6735 259.2464 267.4134 331.3961 337.7337 350.2852 400.9113 408.6382 418.8298 483.0825 501.3081 506.6586 542.3540 549.3123 602.0957 612.4388 681.0742 720.1857 735.1925 760.3646 763.8352 811.7740 830.8469 849.3674 854.0401 860.8715 862.9461 976.8173 986.2666 992.3078 1047.4570 1102.3052 1104.7190 1111.8910 1168.6583 1184.0884 1190.2216 1233.6691 1284.3401 1327.8804 1349.1709 1370.3727 1394.2614 1423.0454 1433.7754 1468.5834 1558.0105 1569.6091 1583.7915 1605.1853 3145.7611 3158.2440 3163.8351 3181.7921 3187.7053 3189.3936
redmass: 17.1263 16.3439 4.5887 12.0379 9.8853 11.3939 11.6050 15.2615 18.4819 4.9194 10.6281 9.4192 12.0541 6.9547 7.2014 31.5226 11.6651 7.9872 3.1336 7.6230 2.7404 4.9751 7.2736 5.3352 5.3179 7.2914 7.1901 4.0034 9.4815 10.9980 8.0837 7.6464 1.2564 1.5382 1.4257 6.5920 1.3799 1.3312 1.3520 2.6461 3.4936 1.3740 2.7838 2.1685 1.9167 1.4806 2.2776 4.2799 1.3132 8.4196 6.0758 4.6525 6.5078 3.5502 4.5933 2.4698 9.5984 8.0858 8.1136 6.6115 1.0872 1.0891 1.0967 1.0971 1.0934 1.0941
irintensity: 0.1741 0.2236 0.0917 1.1937 1.9610 0.1875 0.6242 1.3299 0.0315 0.0045 3.6734 1.4204 2.1019 2.5466 0.0310 0.0270 2.0793 4.9224 0.0366 5.0457 12.0045 0.2196 3.9807 13.5412 0.4023 5.3788 27.9170 0.8140 34.3724 66.9594 6.0648 75.8780 0.9491 82.3023 40.8785 17.0427 0.4281 1.3738 0.5256 5.6172 33.1335 16.9588 272.9285 122.1770 15.7311 5.4568 81.5742 438.2252 9.3394 163.6086 13.2346 27.1943 17.7254 270.7883 6.3332 108.6620 70.7901 21.5196 15.1566 227.7051 1.2900 1.4989 8.3967 2.4288 3.6341 1.6122
temp: 298.150 k
press: 1.00000 atm
elementType: 17 17 17 8 8 7 6 6 6 6 6 6 6 6 6 6 6 6 1 1 1 1 1 1
symmnumber: 1
zpe: 389438.7 jmol-1
zpe.correction: 0.148329 hartree
zpe.thermalcorrener: 0.164535 hartree
zpe.thermalcorrenthalpy: 0.165479 hartree
zpe.thermalcorrgfe: 0.101431 hartree
zpe.sumelectzpe: -2044.907265 hartree
zpe.sumelectthermal: -2044.891060 hartree
zpe.sumelectthermalent: -2044.890115 hartree
zpe.sumelectthermalfe: -2044.954163 hartree
dipole: -4.8188 0.0917 -1.2657
dipole: 4.9831
quadrupole: -151.5932 -121.5870 -124.4773
quadrupole: 1.2361 -15.3518 0.1931
quadrupole: -19.0407 10.9655 8.0752 1.2361 -15.3518 0.1931
hfenergy: -2045.0555942 hartree
pointgroup: C01 [X(C12H6Cl3N1O2)]
dipole: 1.910508 0.1076329 -0.426598 debye
dipolederiv: -0.1848298 -0.1727764 -0.1657486 -0.1640453 -0.3900401 -0.2744559 -0.1551652 -0.2589185 -0.2239392 -0.1946482 0.2400456 0.0027195 0.2315749 -0.5678176 -0.0717783 0.0077168 -0.0861807 -0.0403603 -0.7411366 0.1086617 -0.2596817 0.1358712 -0.1271184 0.0225169 -0.3370817 0.0239572 -0.1756962 -2.4668015 0.0088322 0.1465443 0.0906978 -0.237195 0.0431934 0.0251394 0.0436455 -0.3450375 -0.5479043 -0.0024977 0.0453867 -0.4060794 -0.217186 0.2192273 1.1110711 0.1812758 -0.729042 1.3396438 0.1194608 -0.4612168 0.3943976 -0.0981075 -0.2510626 -1.1986388 -0.2261968 0.5278631 1.2759465 -0.0386707 0.0242167 -0.2901774 -0.2328218 -0.1337291 0.6796496 -0.1492289 0.0157754 2.079227 0.047055 -0.2599991 0.1844627 0.1815135 -0.0902449 -0.7313246 -0.0785858 0.4032998 0.1892947 0.2167825 0.3253215 0.1835307 0.6311577 0.4387153 0.1975441 0.4052288 0.3129894 0.1935846 -0.3787757 0.0839522 -0.2711948 0.8746685 0.1352604 0.0009971 0.1755776 0.0495846 -0.7824356 -0.0002467 0.046949 0.0762148 -0.1332262 -0.0904711 -0.1556965 -0.0843889 0.0706596 -0.3821736 -0.0594114 0.1709285 -0.2073962 -0.1578502 0.0483282 0.5791881 0.038378 -0.2910445 -0.4251867 -0.0715246 -0.1872811 -0.0327169 -0.1733771 -0.0967443 -0.1951005 -0.0886297 -0.2045339 -0.4210627 0.1826941 -0.08349 0.1561291 -0.2756765 0.021379 -0.1197417 0.0118609 -0.0967324 1.1067068 -0.1951504 0.4702606 -0.2216239 0.2716695 0.030474 0.5518238 0.030243 0.2168017 0.4241464 -0.0101379 -0.020678 0.1189734 -0.048983 -0.0947156 -0.3587214 -0.0836462 0.1712334 0.413855 0.0486725 -0.1714165 -0.0506445 -0.036618 -0.0147121 0.0803682 -0.0252742 0.014077 -1.2545173 -0.109494 0.4126284 -0.0252119 0.0594029 0.066891 0.2138284 0.0766776 -0.134845 0.1127714 -0.012615 0.0403089 -0.012405 0.1396294 0.0581103 0.0372675 0.0581791 0.0058344 -0.0189539 0.0298813 -0.0589985 0.0497701 0.1182489 0.0245823 -0.1016473 0.0256981 0.0670937 0.0905531 0.0316664 -0.0191675 0.0342953 0.0625025 -0.0265789 -0.0291218 -0.0254766 0.1502319 0.0907057 -0.0070709 -0.0349211 -0.0037604 0.0799904 -0.0436372 -0.0439749 -0.0450448 0.1322265 0.0141792 0.0343962 -0.0767402 0.018511 0.1428245 0.0343152 -0.0334769 0.0332645 0.0725927 0.0890358 -0.0097766 0.0301227 0.010827 0.1344095 0.0451367 -0.0249029 0.0475851 0.0309678 unknown
polarizability: 274.5404717|-8.8914648|139.9275189|8.2293149|4.5056055|137.9250682 unknown
InChI: InChI=1S/C12H6Cl3NO2/c13-7-5-10(14)12(11(15)6-7)18-9-3-1-8(16-17)2-4-9/h1-6H
charge 0 multiplicity 1
24 atoms
Cl 1.257747 -2.345302 -1.733587
Cl 1.233256 2.790858 0.388265
Cl 5.509044 -0.603055 1.378708
O  0.218802 0.470444 -1.304093
O  -5.165557 -0.561925 1.958567
N  -5.00821 -0.112398 0.761742
C  1.396542 0.18799 -0.588653
C  -1.044472 0.291834 -0.699796
C  2.050399 -1.057661 -0.746849
C  2.037882 1.186879 0.183049
C  -2.148568 0.64184 -1.512122
C  -1.20807 -0.205732 0.620338
C  3.301357 -1.317273 -0.154433
C  3.287564 0.962937 0.791922
C  3.897033 -0.293649 0.608076
C  -3.442411 0.492567 -0.990477
C  -2.504617 -0.350728 1.133065
C  -3.625472 -0.001622 0.329349
H  -1.967828 1.019437 -2.521804
H  -0.334507 -0.470998 1.224194
H  3.791059 -2.284463 -0.287953
H  3.767342 1.745541 1.383685
H  -4.330148 0.749637 -1.577751
H  -2.682568 -0.729457 2.145556
