program: Gaussian 09
title: 000119520
version: EM64L-G09RevD.01
frameworkgroup: C1[X(C12H6Cl4O)]
method: RPBEPBE
basis: SDD
operation: Freq
keyword: #p
keyword: freq=noraman
keyword: PBEPBE/SDD
title: #p freq=noraman PBEPBE/SDD
converged: NO YES NO NO
title: Mulliken charges:
elementType: Cl Cl Cl Cl O C C C C C C C C C C C C H H H H H H
charge: 0.019429 -0.005116 -0.021488 -0.039413 -0.184799 -0.182678 -0.184041 -0.368094 -0.143985 0.426358 -0.202700 0.468502 -0.363731 -0.340156 -0.102411 -0.196922 -0.216187 0.271370 0.276248 0.275328 0.282777 0.265002 0.266708
chargesum: 0.00000
title: Mulliken charges with hydrogens summed into heavy atoms:
elementType: Cl Cl Cl Cl O C C C C C C C C C C C C
charge: 0.019429 -0.005116 -0.021488 -0.039413 -0.184799 0.088691 0.092207 -0.368094 -0.143985 0.426358 0.072627 0.468502 -0.363731 -0.057379 -0.102411 0.068081 0.050521
polarizability: 2.42732072e+02 -1.94418626e+01 1.71612614e+02 1.41051751e+00 -1.63041728e+00 1.12577426e+02
1716.lowfreq: -5.5751 -0.0011 -0.0006 0.0021 5.4021 6.7755 21.5418 52.1035 58.8033
frequency: 21.5329 52.0982 58.8022 65.3844 90.6441 128.8053 178.2762 186.2019 203.6199 235.1155 261.0173 284.3742 298.9902 309.9976 313.6545 333.2177 405.1618 435.1890 453.9615 487.6308 490.3660 524.2811 555.0949 598.3812 645.4246 668.3757 703.7793 710.7942 724.2069 773.6240 801.9526 813.7874 878.2911 891.8456 915.9133 949.1616 987.0055 1010.4870 1049.4139 1059.5249 1078.5766 1086.0113 1133.3555 1154.2285 1232.4821 1260.7348 1270.6964 1308.1138 1325.7104 1348.2831 1357.0288 1380.7550 1429.8610 1462.7785 1536.1974 1558.8017 1595.9109 3047.8409 3058.1814 3160.6749 3166.2630 3173.5323 3184.8374
redmass: 20.8095 11.5487 13.5396 10.7591 10.5196 25.0493 11.1945 11.0467 7.2726 9.5954 7.3200 8.0098 8.0391 15.2080 17.0501 3.9351 5.5629 3.6346 4.0274 7.7203 4.6862 8.4568 9.9865 5.2243 6.9704 6.2192 6.3600 7.7858 4.3339 4.4476 8.8108 1.3464 1.4221 1.4826 3.7169 1.3438 1.7723 7.6378 4.0758 1.7757 3.4185 1.9289 1.4713 4.8580 2.0588 1.5823 1.9910 1.3713 1.1046 2.6108 7.9679 4.1820 3.6100 5.0180 6.8820 6.8974 8.2901 1.0845 1.0836 1.0923 1.0890 1.0929 1.0979
irintensity: 0.0153 0.2414 0.2254 0.3605 0.7646 0.0061 1.1769 1.1271 2.2489 0.6471 3.7566 1.7467 0.4674 0.1168 0.3209 1.3355 0.2275 1.8389 1.2453 19.3906 26.3895 51.9394 61.5284 0.9922 13.1734 10.0258 10.7834 11.0134 6.0863 34.3970 4.7428 41.8551 14.0172 7.1567 14.6657 0.0160 101.3219 51.1038 2.6489 3.3516 12.5700 54.7604 4.8479 125.1727 19.0046 27.5073 6.1822 4.7331 0.9980 52.6440 3.0878 15.1449 43.1791 71.3053 43.3424 17.5229 3.8384 4.0651 3.4449 0.9938 0.2107 0.2476 0.8394
temp: 298.150 k
press: 1.00000 atm
elementType: 17 17 17 17 8 6 6 6 6 6 6 6 6 6 6 6 6 1 1 1 1 1 1
symmnumber: 1
zpe: 370042.3 jmol-1
zpe.correction: 0.140942 hartree
zpe.thermalcorrener: 0.156554 hartree
zpe.thermalcorrenthalpy: 0.157498 hartree
zpe.thermalcorrgfe: 0.095564 hartree
zpe.sumelectzpe: -2375.001150 hartree
zpe.sumelectthermal: -2374.985538 hartree
zpe.sumelectthermalent: -2374.984594 hartree
zpe.sumelectthermalfe: -2375.046528 hartree
dipole: -2.2948 -1.9218 -0.4318
dipole: 3.0242
quadrupole: -133.3651 -126.0618 -126.6225
quadrupole: 2.8079 -2.1616 -4.2570
quadrupole: -4.6820 2.6213 2.0607 2.8079 -2.1616 -4.2570
hfenergy: -2375.1420918 hartree
pointgroup: C01 [X(C12H6Cl4O1)]
dipole: 1.0344124 0.586642 0.0389524 debye
dipolederiv: -0.3266198 0.4112937 -0.1174877 0.3259626 -0.7438057 0.1481745 -0.0869862 0.0744416 -0.0300653 -0.4273162 0.3768186 -0.0717665 0.5757178 -0.8095418 0.1720828 -0.0049315 0.0733728 -0.0370388 -0.3491262 0.1461328 0.2408614 0.146879 -0.1930163 -0.2310186 0.1996516 -0.2280115 -0.3938836 -0.4688629 0.1714335 0.2702188 0.2403808 -0.2026278 -0.2229523 0.3564342 -0.2090424 -0.3705739 -0.6228401 -0.3287891 -0.0443564 -0.3644116 -0.2272569 0.059834 -0.0270484 0.0732248 -0.2524755 0.3359268 0.3691131 0.0190405 0.2057287 -0.2231134 -0.0527899 -0.1524269 -0.09575 0.2540298 0.1127666 0.3007992 0.0496097 0.5238775 -0.0394631 -0.0278847 0.1224812 -0.0196339 0.2637681 0.3773988 -0.5961891 0.1654469 -0.3403019 0.9862018 -0.152336 0.2353249 0.0062826 -0.1083196 0.5300898 -0.5432387 0.0152991 -0.7668826 1.1513917 -0.2128481 -0.1813048 -0.1014289 -0.1433583 0.267187 0.0299885 0.0598151 -0.0545261 -0.161336 -0.0254161 0.1266344 0.0093368 -0.0019995 -0.3790941 0.1076602 -0.0117835 0.0341289 -0.067785 -0.0223782 0.0673441 -0.0352501 -0.0488644 0.194294 0.1612331 0.1164724 0.0413 -0.0344046 -0.0095102 0.0124238 -0.0383667 -0.0528639 0.3255618 -0.2768402 -0.435156 -0.1857223 0.1765833 0.3567475 -0.3303889 0.3591564 0.4776113 -0.2573878 0.039841 0.094645 0.0648094 -0.0832251 -0.0305792 0.0873549 -0.0548632 -0.1213476 0.6225913 -0.3158191 -0.4719098 -0.3740958 0.2222125 0.391272 -0.5690315 0.3716639 0.4825228 -0.1057096 0.0541283 0.0928417 0.0499171 -0.0866013 -0.0014512 0.1029773 0.0048394 -0.1023215 -0.1006469 0.0739667 0.0980295 0.0717529 -0.1222765 -0.0279566 0.0909691 -0.0270463 -0.1453413 -0.0469517 -0.0467948 0.014196 0.015856 0.1115697 0.0496965 0.0361565 0.0089984 -0.022223 0.1120906 -0.0133926 -0.0509873 -0.0931385 0.030533 0.0054815 -0.0357981 -0.0275194 -0.0135253 0.0720843 -0.0623089 0.0044311 -0.0505517 0.0106931 0.0238659 0.014318 0.0241589 0.1308595 0.0945278 -0.0237323 -0.025884 -0.0296264 0.0760634 -0.0676847 -0.0438765 -0.0478201 0.0623184 0.0673276 -0.0187437 -0.0109025 -0.0304214 0.0922093 -0.0841798 -0.0240979 -0.0864348 0.0510429 -0.027291 -0.0165604 -0.0006737 -0.0066326 0.1369956 -0.0381693 0.0038209 -0.034308 0.1220488 unknown
polarizability: 232.6310693|-29.8180734|173.0587515|-10.3372771|22.9447671|121.2322906 unknown
InChI: InChI=1S/C12H6Cl4O/c13-5-1-2-8(14)6(3-5)7-4-9(15)11-12(17-11)10(7)16/h1-4,11-12H
charge 0 multiplicity 1
23 atoms
Cl -0.265882 -2.925553 0.310317
Cl -3.673229 2.604062 -0.668433
Cl 0.437943 1.71932 2.29877
Cl 4.370467 -1.181935 -1.866584
O  -3.948947 -1.43383 -0.162194
C  -2.5034 -1.276059 -0.564425
C  -3.198682 -0.163916 0.181192
C  -1.126857 -1.369757 -0.013706
C  -2.702777 1.097451 -0.433197
C  -0.509094 -0.118713 -0.08332
C  -1.315982 1.093529 -0.422084
C  0.965132 0.074677 0.075262
C  1.522012 0.906374 1.080013
C  1.865529 -0.561269 -0.821333
C  3.249756 -0.354957 -0.697891
C  2.910214 1.111069 1.202182
C  3.792315 0.476242 0.301455
H  -2.495194 -1.174856 -1.662834
H  -3.078688 -0.159144 1.277084
H  -0.762072 2.02158 -0.595794
H  1.472236 -1.206973 -1.610881
H  3.301864 1.753912 1.995058
H  4.872237 0.625747 0.382843
