program: Gaussian 09
title: 000119507
version: EM64L-G09RevD.01
frameworkgroup: C1[X(C12H14N2O3)]
method: RPBEPBE
basis: SDD
operation: Freq
keyword: #p
keyword: freq=noraman
keyword: PBEPBE/SDD
title: #p freq=noraman PBEPBE/SDD
converged: YES YES NO NO
title: Mulliken charges:
elementType: O O O N N C C C C C C C C C C C C H H H H H H H H H H H H H H
charge: -0.221921 -0.240729 -0.430022 -0.458083 -0.184111 0.093206 -0.385544 0.169084 0.451403 0.172205 -0.703228 -0.389505 -0.331669 -0.606589 -0.387033 -0.370643 0.283806 0.221235 0.230504 0.325391 0.242294 0.198693 0.230822 0.246446 0.254177 0.248353 0.248865 0.262729 0.221505 0.253220 0.355138
chargesum: 0.00000
title: Mulliken charges with hydrogens summed into heavy atoms:
elementType: O O O N N C C C C C C C C C C C C
charge: -0.221921 -0.240729 -0.074884 -0.132691 -0.184111 0.093206 0.066196 0.169084 0.451403 0.172205 -0.031420 -0.143059 -0.077492 0.153358 -0.165527 -0.117424 0.283806
polarizability: 1.89742646e+02 -2.02602257e+00 1.16469632e+02 6.61376991e+00 1.03989812e+01 1.42914816e+02
1716.lowfreq: -17.2347 -5.3387 -0.0004 -0.0001 0.0006 4.0690 31.1798 44.4535 66.1241
frequency: 31.0491 44.3648 66.1236 88.6966 99.6799 108.2691 151.5972 160.2390 186.2223 232.2985 239.9710 260.8077 290.9461 315.8062 320.4408 357.6242 367.2210 381.9748 404.1497 410.3930 476.2178 501.8259 525.8434 572.3708 599.8669 632.9369 665.1601 677.5608 693.8310 718.8581 738.2384 761.8634 804.5184 807.9951 831.2839 849.1283 917.5297 935.0938 959.3441 967.2571 1002.6536 1006.1035 1060.9256 1086.4654 1098.4053 1107.7181 1132.0204 1144.5756 1152.9668 1182.6027 1203.0467 1214.2782 1251.2410 1260.0792 1286.2866 1312.0630 1322.7728 1354.1206 1372.1252 1388.4674 1393.3385 1421.3435 1440.1550 1460.0378 1472.4796 1479.6268 1483.2541 1486.3837 1502.5176 1594.0835 1625.8433 1648.7183 1714.6004 2980.2540 2999.0479 3001.6049 3053.4912 3075.6053 3089.8050 3092.8431 3115.4765 3119.9703 3149.8536 3151.9268 3174.4988 3580.7834 3607.6803
redmass: 3.6703 5.4643 3.9919 2.3694 1.3616 2.7058 6.7904 4.3226 1.9946 4.3055 1.7138 3.1541 5.8038 3.1441 5.5781 4.4039 1.1545 6.1367 3.8107 2.9693 1.1641 3.0213 3.2789 5.8516 6.9575 6.7754 4.1139 6.6593 5.4711 7.9834 4.4009 1.6207 3.7915 1.3849 1.6172 2.9903 2.4296 1.4179 1.3997 2.3347 2.8509 1.8835 3.1091 2.6766 1.8918 2.1821 1.3100 1.4359 2.4253 1.1244 2.6903 2.9626 2.4571 3.0681 1.5154 1.3697 1.4474 1.9683 3.3682 4.8605 1.2308 3.2964 1.3338 1.0772 1.0427 1.0531 1.0442 1.0669 2.6491 6.4871 6.4541 11.3399 9.6534 1.0372 1.0621 1.0329 1.0985 1.0990 1.1006 1.1023 1.0891 1.1018 1.0894 1.0934 1.0966 1.0660 1.0797
irintensity: 1.0306 0.0299 0.3843 0.0723 0.3331 1.7499 4.3360 0.0196 3.0919 3.9775 1.5923 5.1710 6.5554 3.9809 2.0736 10.0531 131.0692 23.4196 5.0744 1.4220 128.7286 42.7147 35.5477 2.2517 16.4785 1.7364 6.4535 6.1867 7.9353 11.1053 3.1231 17.1134 3.2722 28.1854 41.8063 20.7860 15.8069 4.5861 6.9716 33.6070 3.9653 7.3678 31.3278 13.2997 50.0029 10.1751 0.2700 249.9244 3.6513 12.7762 0.8384 25.0439 27.7070 51.4974 37.0182 13.9358 17.1690 57.1831 121.8801 33.8777 14.3014 9.2789 110.1002 11.6159 17.2907 10.6243 6.4659 13.5746 88.6606 22.1854 55.7098 516.9802 290.1085 27.9308 20.3411 33.4354 3.6603 39.7679 37.3938 19.6634 17.4664 0.7827 5.9182 6.8726 3.8448 44.1981 37.5590
temp: 298.150 k
press: 1.00000 atm
elementType: 8 8 8 7 7 6 6 6 6 6 6 6 6 6 6 6 6 1 1 1 1 1 1 1 1 1 1 1 1 1 1
symmnumber: 1
zpe: 640054.4 jmol-1
zpe.correction: 0.243784 hartree
zpe.thermalcorrener: 0.260256 hartree
zpe.thermalcorrenthalpy: 0.261200 hartree
zpe.thermalcorrgfe: 0.199377 hartree
zpe.sumelectzpe: -799.640156 hartree
zpe.sumelectthermal: -799.623683 hartree
zpe.sumelectthermalent: -799.622739 hartree
zpe.sumelectthermalfe: -799.684562 hartree
dipole: 1.6979 1.2063 -1.8763
dipole: 2.8033
quadrupole: -102.3043 -93.3407 -104.3871
quadrupole: -5.2412 -15.3939 0.8074
quadrupole: -2.2936 6.6700 -4.3764 -5.2412 -15.3939 0.8074
hfenergy: -799.8839393 hartree
pointgroup: C01 [X(C12H14N2O3)]
dipole: -0.6516 0.265839 0.8492064 debye
polarizability: 189.9944754|-0.0183725|123.4788634|5.8583354|-15.6292997|135.6537551 unknown
InChI: InChI=1S/C12H14N2O3/c1-3-12(8-4-6-9(15)7-5-8)10(16)14(2)11(17)13-12/h4-7,13,15H,3H2,1-2H3
charge 0 multiplicity 1
31 atoms
O  1.251621 0.356478 -2.3244
O  3.381327 -1.290994 1.534756
O  -4.790832 -1.051777 -0.116292
N  1.496435 0.132257 1.227153
N  2.499754 -0.696428 -0.610966
C  0.715657 0.705761 0.114679
C  0.82162 2.264454 0.084502
C  1.487415 0.121911 -1.113593
C  -0.745161 0.213588 0.088367
C  2.543208 -0.682992 0.82611
C  0.165313 2.952419 1.298125
C  -1.247293 -0.683432 1.059369
C  -1.616182 0.648865 -0.94717
C  3.45132 -1.452392 -1.427629
C  -2.589598 -1.121859 1.020545
C  -2.953733 0.217886 -0.999705
C  -3.444439 -0.665023 -0.009277
H  1.894055 2.533607 0.027883
H  0.35585 2.616674 -0.853375
H  1.360222 0.373312 2.206232
H  -0.906771 2.698985 1.372924
H  0.655379 2.668172 2.248908
H  0.250047 4.049729 1.205948
H  -0.587551 -1.060403 1.847361
H  -1.237612 1.304539 -1.737807
H  3.991833 -0.776919 -2.111985
H  2.925841 -2.214245 -2.028225
H  4.162568 -1.94199 -0.743341
H  -2.960292 -1.817315 1.784924
H  -3.625938 0.544141 -1.798474
H  -5.037767 -1.68011 0.606953
