program: Gaussian 09
title: 000119497
version: EM64L-G09RevD.01
frameworkgroup: C1[X(C15H16O3)]
method: RPBEPBE
basis: SDD
operation: Freq
keyword: #pfreq=noraman
keyword: PBEPBE/SDD
title: #p freq=noraman PBEPBE/SDD
converged: YES YES NO NO
title: Mulliken charges:
elementType: O O O C C C C C C C C C C C C C C C H H H H H H H H H H H H H H H H
charge: -0.266477 -0.445070 -0.478818 -0.125548 0.392703 0.270017 0.239297 -0.188019 0.241368 -0.424039 -0.087848 -0.139097 -0.704080 0.533815 -0.535263 -0.720311 -0.720284 -0.825935 0.208337 0.239615 0.239639 0.236671 0.253972 0.254357 0.206153 0.217098 0.217128 0.206162 0.254240 0.227267 0.225055 0.227569 0.387853 0.382472
chargesum: 0.00000
title: Mulliken charges with hydrogens summed into heavy atoms:
elementType: O O O C C C C C C C C C C C C C C C
charge: -0.266477 -0.057217 -0.096347 -0.125548 0.392703 0.270017 0.239297 0.020318 0.241368 0.055215 -0.087848 -0.139097 -0.467410 0.533815 -0.281291 -0.042703 -0.042753 -0.146044
polarizability: 2.32881365e+02 1.44175275e+01 2.12864487e+02 -2.10484743e-02 -1.33217172e-03 9.54520849e+01
1716.lowfreq: -9.2692 -0.0007 -0.0005 0.0006 5.0808 8.9938 50.7441 62.5613 86.7555
frequency: 50.4236 62.5408 86.7532 108.8341 133.8742 144.3403 164.7893 174.1555 221.6139 226.3952 227.2402 238.3787 254.1270 258.8615 269.6379 304.6990 340.7277 370.7753 393.5667 419.4885 421.3225 441.6692 481.8212 500.5174 503.8434 544.0529 572.3448 584.8723 635.7398 641.4490 715.1844 722.4444 754.6763 795.0856 804.0401 855.2069 860.2373 875.4394 895.4354 920.8909 942.5208 957.1257 958.4833 986.7768 987.3542 1009.6171 1047.9890 1082.4754 1101.8477 1114.4643 1115.4449 1130.5459 1147.1190 1161.8052 1216.7529 1243.7487 1276.8590 1298.3798 1304.3509 1309.0456 1339.9118 1365.8056 1369.0196 1386.2603 1396.3942 1400.2583 1441.2640 1448.7329 1462.9204 1464.1761 1468.0402 1475.0052 1479.8312 1481.9780 1493.6823 1499.7548 1516.5961 1623.0223 1634.2770 1640.2752 2973.2379 2978.4244 2980.4808 2985.3043 3008.0969 3035.7486 3049.8302 3067.2128 3071.3449 3084.3474 3097.7195 3103.2482 3147.7685 3162.3780 3497.9993 3636.2540
redmass: 2.7750 4.1369 1.0669 4.0227 5.5474 1.2906 3.2092 2.3293 1.4064 2.6281 2.2108 2.6934 1.2393 3.8054 2.9391 4.0582 4.9066 7.2502 4.9254 3.2405 4.6874 5.4400 4.9062 1.1241 4.0382 5.1287 5.2558 3.4125 5.2615 5.4111 5.2230 5.5820 5.7293 2.5775 4.4332 1.5913 6.4824 1.7781 3.0312 1.1674 3.9160 1.4665 5.5625 1.9878 1.6955 2.1166 1.5440 2.7726 2.9559 1.6131 2.6837 1.0611 1.9262 1.8798 2.3784 1.6685 1.6587 2.5670 1.2977 2.1367 1.7785 2.4406 1.1883 1.3549 1.3646 2.5262 3.1536 2.6162 1.0424 1.4110 1.0461 1.3319 1.2110 1.0516 2.0165 1.1736 4.5630 8.3700 10.1666 8.4316 1.0372 1.0355 1.0368 1.0566 1.0821 1.1085 1.0975 1.0999 1.0992 1.0987 1.0999 1.0989 1.0898 1.0929 1.0646 1.0669
irintensity: 0.4041 0.1154 0.7842 1.7135 1.2799 67.8389 0.4668 88.7322 0.0140 2.3741 14.2235 8.7552 1.9579 0.3180 2.3592 7.0724 2.8528 0.2148 0.3632 0.3124 0.7352 2.6128 6.5952 113.6205 5.0649 0.6706 4.4660 9.6936 0.5740 3.4056 26.6797 1.2841 20.2334 6.2065 15.8235 39.5418 59.4055 1.7374 5.2733 5.2267 37.2628 0.0129 30.0122 0.7190 0.0953 10.5819 11.7860 14.4364 114.3957 132.3624 2.8302 0.0186 134.8977 1.0688 49.0697 18.2063 228.7925 9.7849 1.4791 5.1960 19.5082 4.0323 20.1070 46.7005 26.2397 17.7281 10.4206 52.3503 1.2050 24.8633 13.0484 30.0238 22.7160 3.2832 17.7414 12.1127 37.6258 4.5595 34.0496 84.2596 50.1999 42.6968 56.1569 64.0809 16.2084 17.8383 21.5050 19.6313 70.7936 19.6578 2.2437 28.2113 14.6718 5.9916 105.5425 57.8698
temp: 298.150 k
press: 1.00000 atm
elementType: 8 8 8 6 6 6 6 6 6 6 6 6 6 6 6 6 6 6 1 1 1 1 1 1 1 1 1 1 1 1 1 1 1 1
symmnumber: 1
zpe: 715587.0 jmol-1
zpe.correction: 0.272553 hartree
zpe.thermalcorrener: 0.289709 hartree
zpe.thermalcorrenthalpy: 0.290654 hartree
zpe.thermalcorrgfe: 0.228921 hartree
zpe.sumelectzpe: -805.557208 hartree
zpe.sumelectthermal: -805.540051 hartree
zpe.sumelectthermalent: -805.539107 hartree
zpe.sumelectthermalfe: -805.600840 hartree
dipole: 0.1441 2.4681 0.0030
dipole: 2.4723
quadrupole: -110.9122 -83.7046 -109.8131
quadrupole: 8.0240 0.0072 0.0090
quadrupole: -9.4356 17.7721 -8.3365 8.0240 0.0072 0.0090
hfenergy: -805.8297608 hartree
pointgroup: C01 [X(C15H16O3)]
dipole: 0.0377242 -0.9719213 -0.0075338 debye
polarizability: 232.3029134|-14.8036799|213.4311839|0.9293615|0.6956015|95.4638393 unknown
InChI: InChI=1S/C15H16O3/c1-7(2)12-9-4-8(3)5-11-13(9)10(6-18-11)14(16)15(12)17/h4-5,7,16-17H,6H2,1-3H3
charge 0 multiplicity 1
34 atoms
O  -2.665184 -2.046844 -0.038193
O  3.262991 -0.758955 0.015862
O  1.953972 -3.028405 -0.00902
C  -0.871627 -0.561684 -0.016263
C  -0.187125 0.684362 -0.001713
C  1.259662 0.633358 0.009398
C  -0.269156 -1.845133 -0.020064
C  2.105954 1.907536 0.023332
C  -2.283069 -0.682989 -0.026605
C  -1.397381 -2.868624 -0.034848
C  1.861862 -0.643221 0.005745
C  1.117137 -1.881256 -0.008483
C  -1.043339 1.845422 0.000398
C  -2.446888 1.726729 -0.010467
C  -3.101531 0.437832 -0.024026
C  2.983665 2.038001 -1.252484
C  2.964258 2.023978 1.313542
C  -3.321752 2.970217 -0.007575
H  1.409174 2.766287 0.022629
H  -1.424292 -3.500862 -0.942668
H  -1.436667 -3.513099 0.863849
H  -0.607998 2.849476 0.011258
H  -4.192914 0.365438 -0.031392
H  3.720716 1.219595 -1.303016
H  3.529389 3.000216 -1.239722
H  2.362616 2.006378 -2.1664
H  2.329691 1.98132 2.217674
H  3.509129 2.986743 1.320052
H  3.701347 1.205704 1.365767
H  -3.992367 2.986044 0.872622
H  -2.716166 3.892151 0.012226
H  -3.96653 3.007687 -0.906304
H  3.496172 -1.726006 0.011349
H  1.442751 -3.870995 -0.020261
