program: Gaussian 09
title: 000119451
version: EM64L-G09RevD.01
frameworkgroup: C1[X(C6H10N4O2)]
method: RPBEPBE
basis: SDD
operation: Freq
keyword: #p
keyword: freq=noraman
keyword: PBEPBE/SDD
title: #p freq=noraman PBEPBE/SDD
converged: YES YES NO NO
title: Mulliken charges:
elementType: O O N N N N C C C C C C H H H H H H H H H H
charge: -0.241986 -0.251197 -0.077264 -0.100103 0.096261 -0.012366 -0.357645 -0.348134 -0.305129 -0.309447 -0.379581 -0.084077 0.242269 0.223498 0.242744 0.235992 0.200545 0.226004 0.227503 0.207008 0.278181 0.286926
chargesum: 0.00000
title: Mulliken charges with hydrogens summed into heavy atoms:
elementType: O O N N N N C C C C C C
charge: -0.241986 -0.251197 -0.077264 -0.100103 0.096261 -0.012366 0.108122 0.130602 0.121419 0.125064 0.185527 -0.084077
polarizability: 1.06173208e+02 4.47423480e+00 1.07342970e+02 2.98542942e+00 -3.47415049e-01 7.70090152e+01
1716.lowfreq: -4.1458 -0.0009 -0.0008 -0.0007 7.7464 10.3093 29.8422 37.7650 78.4380
frequency: 29.4486 37.6763 78.4146 94.3362 171.0344 230.6655 235.4140 262.1862 332.0395 338.6604 352.6796 368.9924 396.5566 425.5047 470.8223 526.4958 603.3864 669.7699 739.0468 797.5859 828.0308 839.7306 900.8106 928.0295 934.3064 1013.5327 1031.1850 1046.0050 1053.7792 1078.2079 1094.7788 1136.1857 1169.2169 1181.5529 1248.3180 1250.9853 1278.0291 1282.6593 1307.9030 1326.1652 1346.8804 1353.0655 1364.4379 1373.4221 1433.4285 1444.7956 1454.3209 1454.6880 1468.1564 2199.8646 2957.3450 2961.3262 2971.0964 2972.7825 2994.0808 3061.7430 3062.0402 3070.8596 3089.3890 3094.8388
redmass: 4.2158 5.8130 8.3155 4.8825 5.9048 3.6470 1.9286 3.7139 7.2469 6.1306 4.0418 2.2390 5.0683 3.2942 3.1454 3.4089 7.6963 2.8731 4.0648 4.0642 4.9217 1.5714 2.2279 3.7973 3.8817 2.2818 2.2830 2.9843 1.9735 4.3906 2.4107 4.1718 2.9234 1.0735 1.2937 1.2167 1.3900 1.2334 1.5029 1.2764 1.2824 3.5581 1.6451 1.3023 1.0893 1.0808 1.0907 1.0822 1.0931 12.4061 1.0675 1.0681 1.0648 1.0619 1.0576 1.0990 1.1007 1.0976 1.0972 1.0983
irintensity: 2.8684 4.1112 4.0124 2.4607 3.6221 11.6771 3.1418 10.6946 0.3408 2.2865 0.2878 5.4547 3.3437 6.1296 4.7833 13.1693 18.5612 5.5667 0.2722 6.9682 98.1916 0.3455 3.3266 36.4544 12.4950 2.5423 8.1506 31.6771 23.0591 55.1886 7.2724 0.0971 68.7796 2.2745 17.4341 11.6443 2.8607 2.1714 6.5388 0.7447 12.6605 118.0163 18.6524 4.8492 20.5183 4.1896 14.9370 6.1551 14.9681 9.5382 37.8608 31.0700 24.1777 75.7600 16.6152 24.3363 9.1295 16.3730 26.7147 23.1256
temp: 298.150 k
press: 1.00000 atm
elementType: 8 8 7 7 7 7 6 6 6 6 6 6 1 1 1 1 1 1 1 1 1 1
symmnumber: 1
zpe: 443926.3 jmol-1
zpe.correction: 0.169083 hartree
zpe.thermalcorrener: 0.180907 hartree
zpe.thermalcorrenthalpy: 0.181851 hartree
zpe.thermalcorrgfe: 0.129757 hartree
zpe.sumelectzpe: -603.014948 hartree
zpe.sumelectthermal: -603.003124 hartree
zpe.sumelectthermalent: -603.002179 hartree
zpe.sumelectthermalfe: -603.054273 hartree
dipole: 1.4529 -0.7463 2.7251
dipole: 3.1772
quadrupole: -81.5360 -83.6547 -65.1098
quadrupole: 1.2992 -3.1298 -5.5549
quadrupole: -4.7692 -6.8879 11.6571 1.2992 -3.1298 -5.5549
hfenergy: -603.1840304 hartree
pointgroup: C01 [X(C6H10N4O2)]
dipole: -0.4355082 0.243724 -1.1460369 debye
dipolederiv: -0.5151225 0.071884 -0.0717368 0.0726576 -0.4791463 -0.1070813 -0.0750875 -0.1021337 -0.7495715 -0.7409051 0.9123684 -0.0745391 0.2350257 -0.7059492 0.0445725 0.0352328 -0.0122232 -0.1937575 -0.3136209 -0.1087167 0.0290795 -0.2268453 -0.3335542 0.0413639 0.0880841 0.0136778 -0.2648229 0.4393754 -0.0804551 0.0223428 0.4753614 -0.6008875 -0.0549479 -0.1879363 0.02961 -0.299606 0.1424655 -0.8381461 0.0395216 -0.5645946 1.1715283 -0.1532666 0.0843237 -0.1491173 -0.0107128 -0.2437795 0.0031167 0.0009952 -0.0776595 -0.2835816 0.0108598 -0.0651334 -0.0751972 -0.1976341 0.1871815 0.1500138 0.1675205 0.2535749 0.1400857 -0.0178843 0.199709 -0.0098914 0.2442093 0.0217625 0.0623562 -0.2161211 0.0530829 0.2293795 0.0118921 -0.2526503 0.0212313 0.2773359 0.2707638 -0.042839 -0.1719944 -0.1136701 0.3933003 -0.0084583 -0.0847859 0.0418701 0.5722854 0.3868296 0.0732709 0.2340543 -0.009821 0.4168227 0.0873147 0.186836 0.0214233 0.4434631 0.2058601 0.2034023 -0.0032541 0.0627538 0.0185609 -0.0106137 -0.0492384 -0.0168729 0.2955931 -0.037142 -0.0492261 0.0570053 0.0672807 0.1103187 0.0824517 0.1199552 0.177943 -0.0056091 -0.0079306 -0.0454383 -0.0534566 -0.0932712 -0.1059488 -0.0023684 -0.0186118 0.091611 0.0242547 0.0228703 0.0185032 0.1223227 -0.0164837 0.0758757 -0.0290661 0.0552112 -0.0285317 -0.0977026 0.0016708 -0.0543533 -0.1057604 -0.045342 0.0576889 -0.0441145 -0.0571291 -0.037564 -0.0023265 0.0135896 -0.0039388 0.0781668 -0.0293497 -0.1202602 0.1109354 0.0756837 -0.004132 -0.0081486 0.0445506 -0.0625965 0.1121186 -0.0092986 -0.1502871 0.1232996 0.0426905 0.0225868 -0.0304019 -0.0529764 -0.0286263 -0.1012135 -0.0476798 0.0536713 -0.0798939 -0.0706103 -0.0512086 -0.0300808 -0.0024443 0.0293137 0.0742052 0.0078765 0.0855897 -0.0129854 0.0612329 -0.0457991 -0.1031895 0.0119753 -0.0998635 -0.0595804 -0.0486783 -0.1525523 0.0064589 -0.0267996 0.1148603 0.0161417 0.1267378 -0.0709434 -0.0615606 -0.0457762 0.0216405 0.0328284 -0.0137682 0.0169544 -0.006593 0.0382884 -0.0390864 -0.0181154 0.1008563 0.1577052 -0.0312964 -0.0472083 -0.0190971 0.1268737 unknown
polarizability: 103.7640004|-6.6351211|104.0045234|4.7311247|10.4490314|82.7566695 unknown
InChI: InChI=1S/C6H10N4O2/c7-1-2-10(8-11)9-3-5-12-6-4-9/h2-6H2
charge 0 multiplicity 1
22 atoms
O  -3.170101 0.470897 0.033864
O  2.089526 -2.572052 0.039755
N  -0.349046 -0.001369 -0.245666
N  0.906735 -0.663169 -0.217343
N  0.926004 -2.036415 0.054629
N  2.533616 2.051126 1.303028
C  -1.316626 -0.610266 -1.212556
C  -0.955748 0.158355 1.11666
C  -2.545778 0.31362 -1.288336
C  -2.201054 1.051388 0.977763
C  2.139499 0.119567 -0.491878
C  2.361805 1.1833 0.502648
H  -1.625716 -1.625788 -0.888992
H  -0.830595 -0.681596 -2.202095
H  -0.216812 0.641934 1.778665
H  -1.236272 -0.829688 1.540634
H  -2.245617 1.306814 -1.685677
H  -3.322136 -0.125866 -1.935333
H  -2.732019 1.130217 1.939875
H  -1.89829 2.063148 0.634252
H  2.069576 0.57025 -1.497735
H  2.97415 -0.609009 -0.475562
