program: Gaussian 09
title: 000014493
version: EM64L-G09RevD.01
frameworkgroup: C1[X(C8H18S2)]
method: RPBEPBE
basis: SDD
operation: Freq
keyword: #pfreq=noraman
keyword: PBEPBE/SDD
title: #p freq=noraman PBEPBE/SDD
converged: YES YES NO NO
title: Mulliken charges:
elementType: S S C C C C C C C C H H H H H H H H H H H H H H H H H H
charge: -0.029565 -0.029604 -0.378863 -0.378850 -0.366866 -0.366816 -0.302326 -0.302456 -0.734462 -0.734304 0.195909 0.193784 0.195911 0.193766 0.194292 0.192428 0.194295 0.192408 0.199838 0.219105 0.219121 0.199845 0.266581 0.259170 0.259152 0.266566 0.090976 0.090964
chargesum: 0.00000
title: Mulliken charges with hydrogens summed into heavy atoms:
elementType: S S C C C C C C C C
charge: 0.061412 0.061361 0.010830 0.010826 0.019854 0.019887 0.116617 0.116510 -0.208711 -0.208586
polarizability: 1.68153850e+02 -1.17356683e+01 9.88717930e+01 -1.93978274e+00 -7.09380095e+00 9.44641395e+01
1716.lowfreq: -7.3191 -0.0017 -0.0013 0.0020 4.4081 20.7372 26.5893 37.9370 51.4820
frequency: 20.7378 37.9370 51.4819 67.0513 100.4560 104.4580 119.0346 144.4415 153.4448 175.1048 188.3846 198.6404 215.7949 324.4933 332.4379 452.1213 458.6786 672.3064 674.8144 726.0803 726.2188 728.2561 746.6630 782.0769 824.4070 871.7158 933.4198 988.3442 994.0812 1005.6026 1040.1885 1052.9081 1074.6269 1077.6760 1084.3439 1108.0328 1111.8066 1200.9652 1203.2052 1236.0191 1238.2909 1262.9617 1269.5474 1282.7114 1286.6598 1291.1395 1296.9167 1298.8623 1320.0462 1341.1702 1352.6818 1355.6494 1449.2519 1449.2757 1462.5630 1463.2703 1465.5864 1471.4892 1480.7232 1487.8255 2427.0937 2427.1842 2954.3578 2954.5468 2958.3302 2965.5188 2975.7122 2976.6379 2989.2600 2997.7787 3011.8151 3022.2203 3022.3777 3029.1897 3041.8432 3048.1422 3095.4009 3095.5627
redmass: 5.8953 6.6199 1.6787 3.4796 1.6349 4.9370 2.6249 1.7543 2.1852 5.4213 1.4771 1.2125 2.4023 5.2862 3.5887 3.7553 3.1368 3.3796 3.0333 1.0604 1.1208 1.1884 1.2160 1.1937 1.1824 1.2130 1.2551 5.1098 2.4065 1.6060 3.6886 3.3064 2.4833 2.1790 2.5674 1.6203 1.1699 1.5703 1.1948 1.2290 1.3539 1.2261 1.2255 1.0349 1.1207 1.2599 1.1017 1.1097 1.3303 1.4483 1.5420 1.6410 1.0838 1.0843 1.0702 1.0797 1.0649 1.0955 1.0996 1.1007 1.0383 1.0383 1.0588 1.0588 1.0594 1.0593 1.0619 1.0612 1.0966 1.0988 1.1014 1.0591 1.0583 1.1015 1.1029 1.1039 1.1073 1.1073
irintensity: 1.7404 1.0450 4.1756 0.0000 0.0000 0.0000 2.4963 3.8484 0.0000 0.0001 23.7211 0.0013 29.0171 2.0262 0.0000 0.0000 1.5748 26.4850 0.0075 16.4449 0.0793 3.9482 0.0000 5.6832 0.0000 7.1866 0.0000 0.0000 0.5287 3.4824 5.7103 0.0000 1.7415 0.0001 0.0000 0.0001 9.6573 0.0006 21.6290 0.0000 4.7298 12.6957 0.0000 0.0000 3.1851 0.0000 0.1333 0.0000 14.5637 0.0001 0.2149 0.0000 1.3594 4.6067 0.6766 0.0001 0.0001 4.5898 0.0002 27.2420 26.0143 37.0000 1.7617 0.1827 0.0030 65.5368 0.8404 104.3719 0.0007 3.4252 0.0008 57.7022 4.9305 11.1403 0.0037 163.9447 11.6571 52.2096
temp: 298.150 k
press: 1.00000 atm
elementType: 16 16 6 6 6 6 6 6 6 6 1 1 1 1 1 1 1 1 1 1 1 1 1 1 1 1 1 1
symmnumber: 1
zpe: 630001.7 jmol-1
zpe.correction: 0.239955 hartree
zpe.thermalcorrener: 0.254640 hartree
zpe.thermalcorrenthalpy: 0.255585 hartree
zpe.thermalcorrgfe: 0.195603 hartree
zpe.sumelectzpe: -1110.908216 hartree
zpe.sumelectthermal: -1110.893531 hartree
zpe.sumelectthermalent: -1110.892587 hartree
zpe.sumelectthermalfe: -1110.952568 hartree
dipole: 0.0015 0.0002 0.0018
dipole: 0.0024
quadrupole: -119.4798 -78.7788 -76.8859
quadrupole: -0.4032 11.2721 -3.4469
quadrupole: -27.7650 12.9360 14.8289 -0.4032 11.2721 -3.4469
hfenergy: -1111.1481711 hartree
pointgroup: C01 [X(C8H18S2)]
dipole: 0.0006067 -0.0001069 -0.0007055 debye
polarizability: 167.5754913|13.4385966|98.3065742|0.8179688|-7.3942685|95.6077167 unknown
InChI: InChI=1S/C8H18S2/c9-7-5-3-1-2-4-6-8-10/h9-10H,1-8H2
charge 0 multiplicity 1
28 atoms
S  6.116487 0.368143 0.04219
S  -6.117601 -0.373461 -0.034562
C  0.659834 0.398287 -0.003855
C  -0.660694 -0.404263 0.009452
C  1.917017 -0.50128 -0.002282
C  -1.917892 0.495174 0.007546
C  3.23482 0.311281 -0.013832
C  -3.235716 -0.317334 0.019953
C  4.477473 -0.59293 -0.01805
C  -4.478192 0.587216 0.023724
H  0.689855 1.070924 0.878392
H  0.680463 1.055909 -0.897796
H  -0.690523 -1.077165 -0.872615
H  -0.681352 -1.061711 0.903543
H  1.896726 -1.157251 0.892773
H  1.886769 -1.17457 -0.884331
H  -1.897853 1.150626 -0.887915
H  -1.887513 1.169088 0.889139
H  3.251854 0.970033 -0.906259
H  3.27309 0.977264 0.870069
H  -3.274315 -0.983921 -0.863456
H  -3.252715 -0.975383 0.91287
H  4.513892 -1.227357 0.884496
H  4.498971 -1.251545 -0.903181
H  -4.499068 1.246737 0.908185
H  -4.514854 1.220637 -0.879508
H  5.946724 1.017815 -1.170671
H  -5.946686 -1.023063 1.178178
