program: Gaussian 09
title: 000124385
version: EM64L-G09RevD.01
frameworkgroup: C1[X(C14H14N4O2)]
method: RPBEPBE
basis: SDD
operation: Freq
keyword: #p
keyword: freq=noraman
keyword: PBEPBE/SDD
title: #p freq=noraman PBEPBE/SDD
converged: YES YES NO NO
title: Mulliken charges:
elementType: O O N N N N C C C C C C C C C C C C C C H H H H H H H H H H H H H H
charge: -0.233659 -0.280794 -0.160012 -0.304478 -0.138194 -0.022697 0.281242 0.050294 -0.530646 0.193829 0.177373 -0.404802 0.447978 -0.629087 -0.629740 -0.367193 -0.386255 -0.219506 -0.206634 -0.241553 0.269523 0.260437 0.288169 0.241876 0.264858 0.273174 0.228545 0.280890 0.241058 0.269807 0.279347 0.235714 0.235462 0.235676
chargesum: 0.00000
title: Mulliken charges with hydrogens summed into heavy atoms:
elementType: O O N N N N C C C C C C C C C C C C C C
charge: -0.233659 -0.280794 -0.160012 -0.304478 -0.138194 -0.022697 0.281242 0.050294 -0.000687 0.193829 0.177373 -0.116633 0.447978 0.150821 0.120753 -0.097387 -0.106908 0.016208 0.028828 -0.005877
polarizability: 2.65874716e+02 -2.83041832e+00 1.94021395e+02 -5.73177197e+00 -1.25456203e+01 1.03539877e+02
1716.lowfreq: -9.0487 -2.7771 0.0003 0.0005 0.0006 8.3937 42.4435 51.5812 65.4979
frequency: 42.3879 51.5785 65.4945 81.5584 87.7750 107.4207 120.8954 148.6489 173.8414 180.4365 228.2443 254.3472 260.7822 310.8956 319.6085 347.4537 355.4440 388.1386 407.2498 410.1913 426.7495 449.5502 500.0328 524.3865 566.0783 611.3692 613.1538 633.9500 655.4852 670.4865 698.0241 729.4983 746.2612 755.9912 769.0733 847.4847 864.8631 878.5062 893.3284 923.1158 941.1239 968.8665 977.0351 988.8504 996.3009 1016.9115 1026.0409 1040.8164 1055.3518 1087.9265 1119.9797 1122.5816 1139.2084 1156.0963 1174.0891 1178.8528 1186.9764 1197.3231 1243.2898 1279.6510 1309.7676 1318.6888 1329.9432 1347.0329 1384.0214 1387.3831 1396.5133 1423.2019 1424.0790 1444.5723 1459.0082 1461.7217 1473.1043 1481.9636 1486.8873 1490.5972 1503.7318 1534.6275 1587.2382 1598.1567 1609.5521 1614.9662 2975.4695 3000.0273 3007.2900 3056.7503 3101.1535 3108.7305 3117.3405 3125.4808 3134.6402 3143.7438 3156.1607 3168.8259 3181.7723 3235.7961
redmass: 4.0748 4.4870 5.5491 1.4610 3.9840 3.4570 3.6362 1.0583 3.2991 5.0275 4.2851 5.1805 6.7510 4.7116 4.5379 3.5159 5.5881 5.6783 3.5154 3.5103 7.0179 3.5260 3.4091 3.9721 6.1211 6.4113 6.0910 5.9051 5.9278 7.8856 2.0712 6.3227 5.8756 6.4896 1.6808 1.2495 1.6165 2.8930 5.2356 1.4144 3.0464 2.9974 1.3717 6.1962 1.3218 3.3518 3.6794 2.6230 2.0608 1.5767 1.3406 1.3104 1.9241 2.7555 1.0606 1.6578 1.3634 1.7234 3.4968 4.6197 3.1417 1.3919 1.9322 2.3006 6.3562 5.1216 2.4223 1.3194 1.2554 2.2286 1.2040 1.1018 1.4930 1.2832 1.8228 1.2739 1.7301 6.1749 9.0693 6.9601 6.4877 7.7679 1.0355 1.0662 1.0326 1.1015 1.1016 1.0976 1.0983 1.1033 1.0853 1.0891 1.0941 1.0983 1.0980 1.0984
irintensity: 0.6134 1.2790 0.6883 0.5017 4.5222 1.6120 0.2811 0.1146 4.6537 7.9468 1.7804 0.9176 1.3372 5.2385 6.3067 16.3055 4.1320 1.3715 1.0367 2.5151 9.5040 4.1196 10.4652 4.3302 1.4323 0.5281 8.4341 2.0196 15.1119 5.2938 37.0719 6.5278 22.6725 16.2503 68.1618 0.3488 17.8986 6.6537 7.5067 6.9055 27.3532 27.8189 0.4851 0.6805 0.2277 3.6266 3.6436 22.5650 5.6205 7.6018 5.2660 3.9738 75.1126 26.1174 0.1509 12.5093 15.0320 69.4961 2.0576 9.6205 5.7734 1.1347 28.4773 10.2411 16.5792 119.0957 17.2540 51.3880 18.0557 17.7386 31.3684 18.6536 32.5492 20.9574 54.3372 36.7270 202.7006 49.7382 352.0480 46.9489 105.2114 211.4572 61.1490 19.1168 24.0745 27.1736 11.7104 6.4113 1.0063 3.1792 1.2343 6.6248 24.4803 16.1337 3.9071 0.9805
temp: 298.150 k
press: 1.00000 atm
elementType: 8 8 7 7 7 7 6 6 6 6 6 6 6 6 6 6 6 6 6 6 1 1 1 1 1 1 1 1 1 1 1 1 1 1
symmnumber: 1
zpe: 691303.9 jmol-1
zpe.correction: 0.263304 hartree
zpe.thermalcorrener: 0.280649 hartree
zpe.thermalcorrenthalpy: 0.281593 hartree
zpe.thermalcorrgfe: 0.217860 hartree
zpe.sumelectzpe: -909.912006 hartree
zpe.sumelectthermal: -909.894660 hartree
zpe.sumelectthermalent: -909.893716 hartree
zpe.sumelectthermalfe: -909.957449 hartree
dipole: -3.2456 2.5448 -1.0605
dipole: 4.2584
quadrupole: -104.9128 -132.0257 -113.5153
quadrupole: 3.2841 -8.7370 -2.7374
quadrupole: 11.9052 -15.2077 3.3026 3.2841 -8.7370 -2.7374
hfenergy: -910.1753094 hartree
pointgroup: C01 [X(C14H14N4O2)]
dipole: -1.3105935 0.7673187 -0.707477 debye
polarizability: 265.9201124|-2.6298077|175.797577|-5.647653|-38.3368248|121.7182984 unknown
InChI: InChI=1S/C14H14N4O2/c1-16-9-12(19)17(2)13-11(14(16)20)8-15-18(13)10-6-4-3-5-7-10/h3-8H,9H2,1-2H3
charge 0 multiplicity 1
34 atoms
O  1.64152 3.083925 -0.715787
O  3.598178 -1.634742 1.119469
N  0.43872 1.251097 0.086981
N  -0.88107 -0.835158 0.336226
N  3.297718 0.146761 -0.373527
N  -0.671648 -2.199677 0.636806
C  0.330486 -0.149906 0.216579
C  1.357457 -1.107421 0.396491
C  2.427346 0.834572 -1.350512
C  1.482133 1.832234 -0.663333
C  2.823622 -0.903772 0.422625
C  0.67714 -2.335692 0.663742
C  -2.229414 -0.393657 0.112848
C  -0.389249 2.153695 0.931569
C  4.719768 0.527624 -0.314672
C  -2.519114 0.554054 -0.898301
C  -3.269414 -0.97133 0.879257
C  -3.857076 0.947878 -1.116589
C  -4.602565 -0.57519 0.645549
C  -4.902245 0.389301 -0.345564
H  1.853978 0.09438 -1.940413
H  3.06015 1.417258 -2.036758
H  1.129894 -3.300975 0.879981
H  -0.697296 1.617309 1.842577
H  -1.285921 2.507605 0.397097
H  0.22923 3.027406 1.191966
H  5.231496 0.303343 -1.269921
H  5.193093 -0.061404 0.486016
H  4.8230 1.60616 -0.096156
H  -1.715634 0.959303 -1.521732
H  -3.020874 -1.727284 1.62871
H  -4.081816 1.679753 -1.899823
H  -5.408361 -1.021173 1.238187
H  -5.93913 0.694523 -0.521288
