program: Gaussian 09
title: 000119346
version: EM64L-G09RevD.01
frameworkgroup: C1[X(C12H6Cl4O)]
method: RPBEPBE
basis: SDD
operation: Freq
keyword: #p
keyword: freq=noraman
keyword: PBEPBE/SDD
title: #p freq=noraman PBEPBE/SDD
converged: NO NO NO NO
title: Mulliken charges:
elementType: Cl Cl Cl Cl O C C C C C C C C C C C C H H H H H H
charge: -0.045717 -0.002482 -0.009925 -0.000253 -0.380032 0.413511 0.372046 -0.389098 -0.395166 -0.345544 -0.389495 -0.279030 -0.278860 0.465337 -0.089417 -0.211277 -0.114463 0.267592 0.268184 0.266274 0.248508 0.260610 0.368698
chargesum: 0.00000
title: Mulliken charges with hydrogens summed into heavy atoms:
elementType: Cl Cl Cl Cl O C C C C C C C C C C C C
charge: -0.045717 -0.002482 -0.009925 -0.000253 -0.011334 0.413511 0.372046 -0.121506 -0.126981 -0.079271 -0.140987 -0.279030 -0.278860 0.465337 -0.089417 0.049333 -0.114463
polarizability: 3.00769817e+02 4.30284843e-01 1.86908956e+02 2.35632772e+00 5.98084335e+00 7.21176017e+01
1716.lowfreq: -1.1136 0.0008 0.0029 0.0033 4.8630 5.6554 29.6565 46.1526 63.3382
frequency: 29.6126 46.1463 63.3365 100.9141 124.0001 154.8376 181.3723 184.6998 202.6555 209.3261 239.3816 269.5954 288.2355 341.9227 355.1631 378.7952 417.7915 439.9353 456.8880 464.7504 485.6676 491.2750 537.6579 583.1157 624.5918 643.8234 671.4746 702.8443 715.3017 751.0872 775.9941 822.1737 862.0749 867.0270 881.1661 889.9838 952.7473 999.6173 1048.7602 1057.6720 1123.5709 1146.4962 1154.2610 1233.7584 1250.9047 1274.0806 1311.2370 1327.6356 1369.4046 1397.3008 1407.8594 1449.4391 1490.7648 1550.0367 1566.7580 1595.6008 1606.9348 3147.9291 3158.3224 3165.5775 3168.2760 3171.9102 3487.1659
redmass: 13.7796 11.2793 11.9366 12.6470 7.0747 26.1678 7.1331 21.3431 12.9711 5.0115 13.3370 7.7753 8.2722 7.4514 16.9780 7.7921 9.1625 3.2000 1.1126 6.4751 7.6355 5.3966 5.2346 4.8245 4.5601 8.6880 8.0438 3.4102 4.6603 9.0189 7.3021 1.3682 4.2101 1.6708 1.4040 1.5824 1.3549 5.7798 4.1721 2.9846 2.3658 1.4970 1.4835 1.7131 1.4232 1.4740 3.9484 3.1094 6.7124 3.9761 5.2024 2.8044 4.2741 6.3724 7.5878 6.4968 8.0884 1.0887 1.0920 1.0916 1.0929 1.0964 1.0649
irintensity: 0.3422 0.2447 0.4579 0.0078 0.2601 0.0929 0.1563 0.0261 0.4133 0.9470 0.1009 4.7620 5.1872 2.5006 1.1725 1.2043 0.2438 8.0107 139.6636 17.0521 27.6931 8.2907 10.0659 7.1447 0.2541 1.4423 34.1259 1.4657 5.7682 93.1533 27.0167 43.0663 20.0834 20.8116 5.8892 1.7075 0.4558 32.4545 3.1544 35.1562 78.2519 187.6874 16.7677 79.4974 4.0630 41.2023 49.5597 18.4564 22.4696 15.8684 5.6747 283.0902 15.7143 63.0755 12.9607 5.3179 1.1808 4.9856 2.1082 0.0752 0.6935 2.4148 99.2612
temp: 298.150 k
press: 1.00000 atm
elementType: 17 17 17 17 8 6 6 6 6 6 6 6 6 6 6 6 6 1 1 1 1 1 1
symmnumber: 1
zpe: 376038.0 jmol-1
zpe.correction: 0.143225 hartree
zpe.thermalcorrener: 0.158713 hartree
zpe.thermalcorrenthalpy: 0.159657 hartree
zpe.thermalcorrgfe: 0.098460 hartree
zpe.sumelectzpe: -2375.152793 hartree
zpe.sumelectthermal: -2375.137306 hartree
zpe.sumelectthermalent: -2375.136361 hartree
zpe.sumelectthermalfe: -2375.197559 hartree
dipole: 0.9316 0.2249 -0.8004
dipole: 1.2486
quadrupole: -139.8923 -119.3563 -127.7042
quadrupole: 12.3280 0.2169 2.3533
quadrupole: -10.9080 9.6279 1.2801 12.3280 0.2169 2.3533
hfenergy: -2375.2960185 hartree
pointgroup: C01 [X(C12H6Cl4O1)]
dipole: 0.3653774 0.0691139 -0.3210222 debye
dipolederiv: -0.338624 -0.2328681 0.0408267 -0.3210543 -0.608292 0.115607 0.0537131 0.1128685 -0.0645705 -0.3225599 0.2643032 -0.0641308 0.3959364 -0.5181739 0.1168466 -0.0939701 0.1146853 -0.0570027 -0.3239889 0.2512619 0.0984646 0.3845385 -0.4548239 -0.1658271 0.1491143 -0.1622721 -0.0964798 -0.9123395 -0.1013371 -0.0306187 -0.1138833 -0.0672988 -0.0149853 -0.0412691 -0.0136404 -0.0312806 -1.6582385 -0.2155789 0.0077627 -0.2198878 -0.1260009 -0.0500618 -0.0041906 -0.0557542 -0.3564694 0.1536244 -0.0151896 0.0061608 0.044713 -0.0211838 -0.0247723 -0.0025865 -0.0005866 -0.0114214 0.5447023 0.0453144 0.0066337 0.0184278 -0.001405 0.0401648 -0.005352 0.0080527 0.011148 -0.1551781 0.0335286 -0.0105419 0.1035901 -0.123216 -0.0071343 -0.0967585 -0.0035203 -0.09675 -0.1430468 0.0561644 -0.002767 -0.1156947 -0.1589601 -0.0042459 0.095151 0.0143363 -0.0828067 -0.3159199 0.1316044 0.0565789 0.1165583 -0.1501915 -0.0058695 0.0824057 -0.0149465 -0.0983558 -0.1854214 -0.0380278 -0.0251098 -0.0540365 -0.0147993 0.0680937 -0.0523349 0.0601785 -0.1204242 0.0927981 0.2150614 -0.0390671 0.7546131 0.8925461 -0.1915927 -0.1841682 -0.2041484 -0.0453315 0.2868106 -0.3430609 0.0839298 -0.8820965 0.8007854 -0.2131459 0.2328369 -0.1981981 -0.0253054 1.289437 0.1950303 -0.0045634 0.1913632 -0.3521322 0.1120554 0.0079227 0.1051498 0.084005 0.2419196 -0.5056093 -0.1946124 -0.603309 0.6696388 0.2746387 -0.2665855 0.2709751 0.0733545 -0.208044 -0.0426326 -0.0132685 0.0745824 0.0256195 0.040628 0.0589661 0.0471983 -0.0633526 1.1107353 0.2815547 0.0981083 0.2090748 -0.0976506 -0.024211 0.0782148 -0.0178289 -0.0714846 0.1066975 -0.0650712 0.0103631 -0.0711434 0.0173275 0.0325149 0.0252639 0.0227967 0.1421679 0.0873657 0.067011 -0.0197829 0.0807793 0.0384586 0.0308055 -0.0285616 0.0257103 0.1446018 0.0801437 -0.0621385 -0.02299 -0.0681248 0.0261689 -0.0509747 -0.0332356 -0.0419906 0.1295988 0.032701 0.0862735 0.0371216 0.084796 0.0216873 -0.0556827 0.0466556 -0.0469653 0.1260931 0.0427426 -0.0418436 -0.0160749 -0.049147 0.0120111 -0.0567022 -0.0177103 -0.0577333 0.1404038 0.4936833 0.0362497 -0.0024227 0.0394045 0.1898849 0.0338509 -0.0035214 0.0356332 0.3696621 unknown
polarizability: 300.7330754|-2.6780737|187.218503|0.0873928|2.6664957|71.8447964 unknown
InChI: InChI=1S/C12H6Cl4O/c13-8-2-1-6(3-9(8)14)7-4-10(15)12(17)11(16)5-7/h1-5,17H
charge 0 multiplicity 1
23 atoms
Cl 3.406239 2.84314 -0.540679
Cl 3.777353 -2.575801 0.58978
Cl -4.156604 2.162952 0.831321
Cl -5.575491 -0.629383 -0.188612
O  4.801295 0.18338 0.06042
C  0.549124 -0.0990 -0.043824
C  -0.93459 -0.224205 -0.077375
C  1.36909 -1.231945 0.213677
C  1.181803 1.152764 -0.269732
C  -1.761603 0.858763 0.323867
C  -1.565133 -1.424522 -0.507992
C  2.578656 1.241388 -0.233611
C  2.767159 -1.11738 0.242961
C  3.415622 0.123854 0.019875
C  -3.163784 0.745887 0.292595
C  -2.968116 -1.538015 -0.535858
C  -3.775359 -0.452395 -0.136011
H  0.91781 -2.204979 0.427665
H  0.592027 2.042626 -0.507246
H  -1.320468 1.787567 0.698527
H  -0.960487 -2.267574 -0.857007
H  -3.446062 -2.460471 -0.878613
H  5.109519 1.114748 -0.108927
