program: Gaussian 09
title: 000119264
version: EM64L-G09RevD.01
frameworkgroup: C1[X(C16H8N2O4)]
method: RPBEPBE
basis: SDD
operation: Freq
keyword: #p
keyword: freq=noraman
keyword: PBEPBE/SDD
title: #p freq=noraman PBEPBE/SDD
converged: YES YES NO YES
title: Mulliken charges:
elementType: O O O O N N C C C C C C C C C C C C C C C C H H H H H H H H
charge: -0.144893 -0.144873 -0.151491 -0.151447 -0.030733 -0.033703 -0.573905 0.196674 0.332526 0.226681 0.287261 0.653525 0.143993 0.318657 -0.415926 -0.581826 -0.400029 -0.442674 -0.435625 -0.205975 -0.238298 -0.227822 0.272822 0.258327 0.270761 0.253572 0.258430 0.232153 0.238823 0.235013
chargesum: 0.00000
title: Mulliken charges with hydrogens summed into heavy atoms:
elementType: O O O O N N C C C C C C C C C C C C C C C C
charge: -0.144893 -0.144873 -0.151491 -0.151447 -0.030733 -0.033703 -0.573905 0.196674 0.332526 0.226681 0.287261 0.653525 0.143993 0.318657 -0.157598 -0.309004 -0.129268 -0.189102 -0.177195 0.026178 0.000525 0.007191
polarizability: 2.81782391e+02 -1.16358320e+01 2.65111399e+02 -4.13609592e-02 4.28400462e-02 1.04937742e+02
1716.lowfreq: -83.9128 -52.4820 -1.1125 -0.0008 0.0003 0.0004 6.0254 8.6611 47.4288
frequency: -83.9127 -52.4804 47.4229 73.5132 108.4173 113.0410 123.9755 129.4067 199.8119 229.9883 234.5338 273.1819 291.8299 304.8644 350.4693 393.3254 413.5265 430.9735 483.5022 497.0462 529.9213 559.9236 586.5899 596.4185 613.7388 619.0541 619.3689 648.0592 681.8406 699.1180 710.6915 732.6879 748.1228 763.7853 769.1979 776.6370 819.9174 842.4322 883.3163 893.8088 896.9847 917.0958 931.9139 955.0848 991.6006 993.0420 996.6385 1025.5533 1035.6353 1091.0574 1125.2157 1151.4744 1174.4871 1184.7999 1196.3414 1226.6797 1239.3111 1255.7518 1275.7654 1298.8557 1320.3258 1371.9698 1380.7008 1394.0175 1400.3893 1405.1377 1438.7100 1443.4052 1467.1932 1480.1162 1485.4406 1582.7919 1610.1225 1613.3655 1618.7081 1623.3890 3133.3953 3136.1666 3145.1024 3148.1610 3156.0472 3158.1796 3166.0207 3171.8698
redmass: 14.4069 15.3347 10.5355 6.5537 5.0733 10.1980 10.9197 4.5816 7.1713 6.1497 5.7214 8.9444 4.6755 9.6429 5.3674 8.1336 5.1890 3.0926 6.4838 5.7143 3.5585 6.0439 7.0774 8.9909 4.7966 3.5287 8.5968 9.5687 8.5871 7.5083 8.9986 8.6763 1.8034 8.7186 1.6266 2.6478 2.0015 8.7674 1.4070 1.6503 7.2688 7.1892 1.4947 1.4367 1.3868 1.3509 7.5177 2.2008 2.3173 2.4971 2.3151 2.4246 1.3194 1.4583 1.3017 3.5437 5.1126 5.0570 2.3716 1.7316 4.9626 14.6129 3.3760 14.6168 4.1909 2.5906 3.1901 2.9565 3.7457 6.1227 5.2931 6.5264 7.5738 8.9779 7.4719 7.6264 1.0866 1.0867 1.0901 1.0923 1.0949 1.0930 1.0986 1.1003
irintensity: 0.0269 0.0038 0.0958 0.0902 3.0434 1.9127 1.0299 0.1655 2.4444 0.5514 0.0227 0.5120 0.5404 3.4115 0.6171 5.0746 0.0915 1.6582 5.8199 2.2772 0.0015 0.5494 8.3512 7.1224 1.6185 16.6622 17.4418 0.3111 18.6907 1.3845 9.2812 9.4292 5.1071 17.2924 81.9078 31.0298 5.2551 3.4343 20.2716 22.2633 2.1240 0.1008 0.5200 1.3706 0.8552 0.7000 1.6431 2.5465 1.7768 2.0270 1.6223 25.4611 1.4587 2.3417 0.6540 66.5169 26.1285 82.9344 9.7142 0.5808 3.9458 0.5023 2.4520 286.1966 5.8401 2.8728 12.6788 10.6625 4.2480 35.7476 8.5719 0.2569 1.1260 12.5883 3.2198 2.6784 1.8080 1.4296 4.2690 6.1310 15.5321 0.4718 27.2341 24.1680
temp: 298.150 k
press: 1.00000 atm
elementType: 8 8 8 8 7 7 6 6 6 6 6 6 6 6 6 6 6 6 6 6 6 6 1 1 1 1 1 1 1 1
symmnumber: 1
zpe: 535971.7 jmol-1
zpe.correction: 0.204141 hartree
zpe.thermalcorrener: 0.219011 hartree
zpe.thermalcorrenthalpy: 0.219955 hartree
zpe.thermalcorrgfe: 0.161886 hartree
zpe.sumelectzpe: -1023.255614 hartree
zpe.sumelectthermal: -1023.240743 hartree
zpe.sumelectthermalent: -1023.239799 hartree
zpe.sumelectthermalfe: -1023.297868 hartree
dipole: 6.6556 4.7378 -0.0004
dipole: 8.1697
quadrupole: -125.0462 -107.9567 -136.2603
quadrupole: -9.6185 0.0109 -0.0105
quadrupole: -1.9584 15.1310 -13.1726 -9.6185 0.0109 -0.0105
hfenergy: -1023.4597545 hartree
pointgroup: C01 [X(C16H8N2O4)]
dipole: -2.6171916 -1.8658535 -0.0001451 debye
polarizability: 281.7987951|-11.6240629|265.0949944|0.0413912|-0.0428109|104.9377418 unknown
InChI: InChI=1S/C16H8N2O4/c19-17(20)13-8-9-4-3-7-11-10-5-1-2-6-12(10)15(14(9)11)16(13)18(21)22/h1-8H
charge 0 multiplicity 1
30 atoms
O  1.806324 2.595412 -1.143659
O  1.810706 2.593972 1.143704
O  4.21872 0.052046 -1.144295
O  4.219827 0.047128 1.144529
N  1.65402 2.025175 -0.000045
N  3.645669 -0.082502 0.000115
C  -0.465046 -1.120512 -0.000048
C  -0.134457 0.27527 -0.000106
C  -1.884028 -1.305933 -0.000017
C  -1.41514 1.020597 -0.000149
C  -2.483776 0.050429 -0.000063
C  0.479072 -2.177058 -0.000029
C  1.22023 0.600312 -0.000083
C  2.197791 -0.446641 0.000019
C  -2.376918 -2.614357 0.000024
C  1.864532 -1.802548 0.000023
C  -1.697593 2.399212 -0.0003
C  -0.051718 -3.51327 0.000003
C  -3.824241 0.472349 -0.000071
C  -1.441582 -3.707553 0.000035
C  -3.053645 2.813497 -0.000295
C  -4.102898 1.863324 -0.000174
H  2.655651 -2.559158 0.000121
H  -3.451119 -2.827213 0.000042
H  -0.900333 3.148635 -0.000472
H  0.625385 -4.374143 0.000023
H  -4.644983 -0.252599 -0.000008
H  -1.834934 -4.729849 0.000071
H  -3.290961 3.882349 -0.000409
H  -5.142555 2.207727 -0.000185
