program: Gaussian 09
title: 000119251
version: EM64L-G09RevD.01
frameworkgroup: C1[X(C19H16O6)]
method: RPBEPBE
basis: SDD
operation: Freq
keyword: #pfreq=noraman
keyword: PBEPBE/SDD
title: #p freq=noraman PBEPBE/SDD
converged: YES YES NO NO
title: Mulliken charges:
elementType: O O O O O O C C C C C C C C C C C C C C C C C C C H H H H H H H H H H H H H H H H
charge: -0.188416 -0.236009 -0.281794 -0.279391 -0.259459 -0.262131 -0.285774 -0.099385 -0.448358 0.068971 -0.322374 0.289177 0.057246 0.103946 -0.560302 0.199631 0.089813 0.043364 0.223586 0.228941 -0.414256 -0.389954 -0.190827 -0.517722 -0.521536 0.278848 0.252666 0.234002 0.249809 0.221334 0.241480 0.279889 0.263124 0.259542 0.236062 0.229953 0.206627 0.268687 0.228980 0.214745 0.287263
chargesum: 0.00000
title: Mulliken charges with hydrogens summed into heavy atoms:
elementType: O O O O O O C C C C C C C C C C C C C C C C C C C
charge: -0.188416 -0.236009 -0.281794 -0.279391 -0.259459 -0.262131 -0.006926 0.153281 0.035454 0.068971 0.140441 0.289177 0.057246 0.103946 -0.280413 0.199631 0.089813 0.043364 0.223586 0.228941 -0.151132 -0.130411 0.045235 0.187545 0.209451
polarizability: 3.25547282e+02 2.99165290e+00 2.67214157e+02 -8.70734935e+00 -1.54175919e+00 1.24806814e+02
1716.lowfreq: -4.4601 -0.0008 -0.0001 0.0007 3.9029 6.4247 31.5937 41.3951 57.5586
frequency: 31.5920 41.3425 57.5546 60.7594 90.7133 114.5413 121.6338 130.6177 151.3993 156.4297 165.1977 182.6302 217.3061 225.2982 241.9277 257.9882 267.0342 279.6421 296.2164 324.5616 336.4613 344.1299 425.6377 436.0768 455.1441 466.3796 474.8862 496.8181 527.3987 551.3428 572.4244 592.6318 600.0363 608.0429 621.6641 636.7552 657.7763 696.7411 709.4771 726.4025 744.8571 763.0158 787.3013 807.7468 817.2659 837.8891 858.4601 865.0875 876.7525 883.8153 884.8213 895.6112 904.7389 929.4698 961.5919 974.0389 1008.1878 1029.9346 1035.5351 1052.6476 1065.7869 1072.3205 1098.1063 1104.3824 1108.9843 1148.0487 1152.6938 1154.6097 1157.8625 1170.5031 1171.9118 1196.4981 1217.3941 1230.1253 1244.9543 1256.9627 1261.3237 1286.3469 1291.3016 1311.0166 1323.3964 1334.3603 1367.0714 1377.6318 1394.5911 1413.3856 1422.6082 1426.5063 1444.9665 1451.0394 1460.0857 1465.0417 1474.2790 1477.4146 1484.2349 1487.1659 1542.3322 1565.9517 1589.0800 1605.7744 1637.0479 2970.6171 2983.9043 3007.6666 3027.7425 3052.8774 3084.2809 3095.8300 3102.7966 3116.2057 3120.6327 3126.9962 3128.7555 3148.6135 3173.0743 3183.3637 3192.8189
redmass: 5.0975 5.1716 5.0710 3.9689 5.6618 4.7042 3.2909 2.8520 1.8502 1.2400 1.8009 4.8005 5.2879 3.1225 4.1327 3.5297 6.6183 4.8991 6.3177 5.3020 6.7640 6.6057 6.3430 6.1570 6.2581 5.1780 6.2089 4.7748 7.3891 7.2059 5.4398 5.9031 5.2229 5.3445 5.3081 4.6520 4.3011 5.7946 4.8899 5.7945 3.5773 5.7361 2.2386 3.6211 3.5433 5.9886 3.7021 2.0745 4.0200 1.5265 2.4759 4.3251 4.7529 2.5916 3.7136 1.3206 5.8771 4.7111 2.4900 4.9302 2.3463 1.8611 2.3517 1.3348 1.2414 1.6388 1.3465 1.4158 1.4284 1.2366 1.3489 2.0503 2.4370 1.5849 2.7009 1.4105 1.9551 2.0168 5.1191 1.7837 1.4414 1.3229 5.9859 7.0431 6.4267 1.6171 2.8971 1.4250 1.2298 1.0870 1.5650 1.1484 1.6122 1.6830 1.0609 1.0961 6.7937 8.0173 9.6906 7.7909 10.1552 1.0341 1.0318 1.0665 1.0635 1.0854 1.0984 1.1002 1.1013 1.0979 1.0965 1.1054 1.1039 1.0875 1.0923 1.0990 1.0931
irintensity: 0.8229 1.5740 0.0656 2.0548 1.2455 2.2412 1.5935 8.7370 1.7490 0.2173 3.4921 1.8568 2.5756 1.6368 2.2761 3.3867 0.4897 6.7407 1.7349 1.5750 5.1205 6.7020 6.0818 7.7018 7.0045 2.8189 3.0554 9.7001 24.4758 0.2849 24.8484 6.5972 1.5860 5.4541 6.7904 6.1141 25.1628 1.3383 36.1876 4.5949 13.8856 117.4599 37.4056 33.3127 20.9579 0.5163 103.8039 17.9998 39.7913 0.7190 15.5596 14.4745 31.6314 68.9674 24.4486 2.1155 51.8773 204.9444 77.2678 91.7773 23.2960 10.3976 52.3054 39.1144 8.0792 10.0296 31.1904 25.2146 17.0114 1.4000 12.6897 12.2501 27.1193 24.3561 92.9466 2.0439 7.8143 11.3679 208.0933 4.6958 4.7369 5.3677 106.7030 68.7172 28.1855 72.2715 4.0687 18.4282 87.8731 12.6379 82.7661 5.9454 10.9196 141.1844 14.6682 5.8485 148.0891 305.5200 184.7148 210.6347 245.9641 94.8478 50.4702 37.0270 18.1874 10.7486 20.7723 33.0327 13.3254 21.8664 42.4398 16.9696 16.9714 9.8190 4.0081 8.1017 0.0442
temp: 298.150 k
press: 1.00000 atm
elementType: 8 8 8 8 8 8 6 6 6 6 6 6 6 6 6 6 6 6 6 6 6 6 6 6 6 1 1 1 1 1 1 1 1 1 1 1 1 1 1 1 1
symmnumber: 1
zpe: 814840.3 jmol-1
zpe.correction: 0.310356 hartree
zpe.thermalcorrener: 0.331343 hartree
zpe.thermalcorrenthalpy: 0.332287 hartree
zpe.thermalcorrgfe: 0.260631 hartree
zpe.sumelectzpe: -1183.141579 hartree
zpe.sumelectthermal: -1183.120593 hartree
zpe.sumelectthermalent: -1183.119649 hartree
zpe.sumelectthermalfe: -1183.191304 hartree
dipole: 0.2794 -3.3435 0.0271
dipole: 3.3553
quadrupole: -155.2202 -130.1167 -140.2452
quadrupole: -4.6318 8.3365 2.8301
quadrupole: -13.3595 11.7439 1.6155 -4.6318 8.3365 2.8301
hfenergy: -1183.4519356 hartree
pointgroup: C01 [X(C19H16O6)]
dipole: -0.0370078 -1.3193579 0.0226655 debye
polarizability: 325.6401956|0.014647|267.02533|-9.4340127|-2.5211364|124.9027265 unknown
InChI: InChI=1S/C19H16O6/c1-21-10-4-3-5-11-15(10)17(20)16-12(22-2)8-13-14(18(16)24-11)9-6-7-23-19(9)25-13/h3-5,8-9,19H,6-7H2,1-2H3
charge 0 multiplicity 1
41 atoms
O  -5.094419 -1.100273 -0.131069
O  -3.865728 0.778487 0.82052
O  0.146635 -1.569284 0.062383
O  0.150953 3.392433 0.020661
O  2.370929 1.802732 -0.830652
O  4.777466 0.274817 0.089344
C  -2.811507 -1.463507 0.632714
C  -4.175585 -0.717695 0.893084
C  -3.106953 -2.319315 -0.642079
C  -1.842498 -0.321275 0.416443
C  -4.286036 -1.574269 -1.296604
C  -2.510882 0.913705 0.518739
C  -0.467894 -0.311646 0.153294
C  0.262877 0.901391 -0.049528
C  -1.855953 2.148176 0.356362
C  -0.475142 2.137732 0.064203
C  1.718569 0.828288 -0.325004
C  2.370358 -0.483698 -0.046409
C  1.553051 -1.656536 0.002477
C  3.794858 -0.702036 -0.013768
C  2.061661 -2.965498 -0.03575
C  4.317405 -2.017586 -0.083418
C  3.459984 -3.134023 -0.109555
C  0.40432 3.965319 -1.321323
C  4.56712 1.506801 0.874296
H  -2.519339 -2.101536 1.482739
H  -4.672661 -0.855794 1.862745
H  -3.417038 -3.337173 -0.347892
H  -2.224484 -2.39367 -1.297209
H  -3.955266 -0.70379 -1.894397
H  -4.955655 -2.2082 -1.895981
H  -2.378872 3.099883 0.468515
H  1.370547 -3.811537 -0.009028
H  5.404838 -2.131125 -0.078765
H  3.884761 -4.142213 -0.150325
H  0.837959 4.958114 -1.128828
H  -0.549695 4.068854 -1.874616
H  1.124287 3.336478 -1.869966
H  5.571387 1.780759 1.233882
H  3.893266 1.314962 1.730429
H  4.135676 2.290248 0.233936
