program: Gaussian 09
title: 000118833
version: EM64L-G09RevD.01
frameworkgroup: C1[X(C10H15NO3S)]
method: RPBEPBE
basis: SDD
operation: Freq
keyword: #p
keyword: freq=noraman
keyword: PBEPBE/SDD
title: #p freq=noraman PBEPBE/SDD
converged: NO YES NO NO
title: Mulliken charges:
elementType: S O O O N C C C C C C C C C C H H H H H H H H H H H H H H H
charge: 0.986381 -0.573319 -0.515968 -0.516332 -0.153222 0.474064 -0.401047 -0.400637 -0.337296 -0.336443 -0.110699 -0.656631 -0.657095 -0.243571 -0.242816 0.228534 0.227307 0.228851 0.227217 0.241113 0.241341 0.220014 0.240402 0.220893 0.220089 0.240163 0.221018 0.275951 0.276213 0.375526
chargesum: 0.00000
title: Mulliken charges with hydrogens summed into heavy atoms:
elementType: S O O O N C C C C C C C C C C
charge: 0.986381 -0.197792 -0.515968 -0.516332 -0.153222 0.474064 0.054793 0.055431 -0.096184 -0.095101 -0.110699 0.024677 0.024175 0.032380 0.033397
polarizability: 2.50777347e+02 1.65937580e-01 1.44073387e+02 -1.50241155e-01 8.82045416e+00 1.02501599e+02
1716.lowfreq: -7.0022 -1.7475 -0.0022 -0.0013 0.0021 15.0468 27.5573 45.7198 59.9753
frequency: 27.4097 45.6851 59.6683 84.9766 105.4914 111.1727 127.6745 166.1977 169.8929 207.4358 214.6378 220.5624 260.2797 283.2421 303.8644 313.6078 349.6883 376.6859 388.9050 422.3414 425.8746 462.4853 501.8709 535.4255 554.2541 579.8283 618.9796 712.7388 726.4043 787.2747 791.6725 804.9245 821.2818 828.1027 889.7592 925.3815 954.8054 960.0001 966.2679 974.3547 1014.6387 1043.0046 1063.6589 1075.3489 1078.8293 1095.4847 1132.4707 1162.1681 1199.6070 1203.9059 1269.8744 1288.3670 1309.2779 1341.6095 1351.8229 1378.8768 1390.4972 1393.0999 1399.8394 1441.1454 1468.2580 1469.2583 1479.1182 1483.8107 1495.0089 1496.8038 1517.9676 1565.5251 1610.8333 2986.7286 2987.0235 2995.9148 3000.6736 3043.9047 3049.8040 3083.5756 3083.7175 3094.0973 3095.3776 3154.5678 3154.7488 3178.1745 3181.7165 3478.7108
redmass: 5.5911 4.5410 3.0390 3.9911 4.4394 3.2813 3.8032 2.5234 2.0865 2.3789 1.4487 1.2716 2.2308 5.0633 4.0305 3.1458 7.2005 5.5240 4.4463 3.9836 3.3108 3.0527 3.1925 4.9910 3.3101 4.4221 7.0871 4.0779 3.2608 1.1252 1.2060 1.2423 1.8952 11.8164 2.2815 2.1724 1.3310 6.5308 1.5680 4.5449 3.0258 1.1777 2.4584 2.1779 1.8320 1.6857 1.4580 1.9001 2.2986 1.1419 1.3522 1.2005 1.3320 1.2643 1.3268 4.0254 1.2174 1.2830 1.8335 4.1590 1.0458 1.0430 1.0536 1.0503 1.0987 1.8593 1.4295 7.3109 5.8371 1.0357 1.0358 1.0603 1.0613 1.1031 1.1022 1.0999 1.0997 1.1011 1.1008 1.0892 1.0893 1.0942 1.0950 1.0660
irintensity: 1.6342 0.2340 0.7494 0.3905 0.2879 1.5472 0.4187 22.3267 32.4281 6.7649 1.5762 0.2375 20.1556 23.7245 40.1234 3.1067 3.5563 3.0631 53.6743 7.7688 14.5224 21.6637 32.8675 129.0055 28.6855 99.7161 0.1375 7.0389 0.3463 5.1055 16.1771 0.5709 88.7304 89.3689 0.0381 4.8066 0.9082 80.7587 10.4893 15.3305 21.8248 76.2587 153.1765 12.9908 8.6795 19.4621 0.1645 11.1956 42.4390 30.1234 68.0700 2.3277 7.8831 12.9541 81.0882 3.3150 0.5207 37.8562 60.0739 0.5560 6.8665 16.4301 0.0876 0.7483 34.7595 84.7707 45.0347 9.8395 399.1747 24.8293 24.1985 50.6010 36.8267 4.3914 12.5618 6.4478 72.6875 2.0545 82.0269 2.1831 0.2885 9.1577 17.5805 32.9356
temp: 298.150 k
press: 1.00000 atm
elementType: 16 8 8 8 7 6 6 6 6 6 6 6 6 6 6 1 1 1 1 1 1 1 1 1 1 1 1 1 1 1
symmnumber: 1
zpe: 621160.7 jmol-1
zpe.correction: 0.236588 hartree
zpe.thermalcorrener: 0.253443 hartree
zpe.thermalcorrenthalpy: 0.254387 hartree
zpe.thermalcorrgfe: 0.191433 hartree
zpe.sumelectzpe: -1067.210346 hartree
zpe.sumelectthermal: -1067.193491 hartree
zpe.sumelectthermalent: -1067.192546 hartree
zpe.sumelectthermalfe: -1067.255501 hartree
dipole: 8.6872 -0.4815 1.3050
dipole: 8.7978
quadrupole: -93.6384 -95.1458 -102.8738
quadrupole: 3.1462 -8.8889 2.6234
quadrupole: 3.5810 2.0736 -5.6545 3.1462 -8.8889 2.6234
hfenergy: -1067.4469339 hartree
pointgroup: C01 [X(C10H15N1O3S1)]
dipole: -3.4257894 0.2076482 0.4490606 debye
polarizability: 250.709858|-0.5829723|144.4304919|3.0500065|-7.9537185|102.2119828 unknown
InChI: InChI=1S/C10H15NO3S/c1-3-11(4-2)9-5-7-10(8-6-9)15(12,13)14/h5-8,12H,3-4H2,1-2H3
charge 0 multiplicity 1
30 atoms
S  3.458553 -0.105523 -0.030126
O  3.728897 0.447322 1.736321
O  3.997141 -1.628912 -0.15463
O  4.045188 1.05418 -0.999998
N  -2.597796 0.000933 -0.007439
C  -1.206415 -0.022043 -0.010061
C  -3.358029 1.186668 -0.461006
C  -3.394422 -1.15709 0.45567
C  -0.442327 1.140112 -0.376328
C  -0.480499 -1.211229 0.347009
C  1.619556 -0.069416 -0.014704
C  -3.57221 2.243938 0.647081
C  -3.656278 -2.208308 -0.647892
C  0.959316 1.119253 -0.377309
C  0.921007 -1.233915 0.354668
H  -2.852433 1.639323 -1.333896
H  -4.339689 0.832901 -0.826851
H  -2.896191 -1.625394 1.324544
H  -4.35954 -0.768806 0.830495
H  -0.944413 2.071593 -0.647136
H  -1.012682 -2.127829 0.610772
H  -4.128696 1.813562 1.499049
H  -2.60955 2.623992 1.030506
H  -4.152338 3.099686 0.25542
H  -4.206255 -1.760807 -1.495265
H  -2.71153 -2.622735 -1.040286
H  -4.261684 -3.042682 -0.2484
H  1.53428 2.005787 -0.663203
H  1.46705 -2.145809 0.616614
H  4.71949 0.491448 1.877982
