program: Gaussian 09
title: 000118832
version: EM64L-G09RevD.01
frameworkgroup: C1[X(C10H15NO)]
method: RPBEPBE
basis: SDD
operation: Freq
keyword: #p
keyword: freq=noraman
keyword: PBEPBE/SDD
title: #p freq=noraman PBEPBE/SDD
converged: YES YES NO NO
title: Mulliken charges:
elementType: O N C C C C C C C C C C H H H H H H H H H H H H H H H
charge: -0.467280 -0.176195 -0.416046 -0.359237 0.345646 0.180836 -0.671024 -0.681380 -0.337325 -0.380945 -0.269867 -0.245196 0.203188 0.289107 0.212262 0.196592 0.229623 0.216053 0.213185 0.245076 0.226143 0.205864 0.235839 0.205878 0.220765 0.224696 0.353745
chargesum: 0.00000
title: Mulliken charges with hydrogens summed into heavy atoms:
elementType: O N C C C C C C C C C C
charge: -0.113535 -0.176195 0.076249 0.049617 0.345646 0.180836 -0.012164 -0.004298 -0.101486 -0.175067 -0.049103 -0.020500
polarizability: 1.57654482e+02 1.90360534e+00 1.19041287e+02 4.02358571e+00 1.52650920e+01 8.49077781e+01
1716.lowfreq: -9.9016 -5.2498 -0.0010 -0.0009 0.0005 3.4314 50.4798 60.6261 101.1643
frequency: 50.2770 60.5060 101.1300 106.0525 175.9870 193.0852 212.0639 264.4818 277.9483 301.0276 343.8725 360.7878 378.6517 443.3565 461.4588 513.5066 531.5897 562.7913 572.0050 676.4652 718.4569 734.9143 784.0357 791.9291 802.3346 821.7609 889.9672 895.9712 923.1325 950.1016 1015.8632 1049.7288 1067.6058 1073.0139 1087.8259 1091.7398 1152.3454 1164.9796 1168.6474 1190.6857 1227.2125 1266.8474 1281.8503 1303.2061 1334.9248 1354.2327 1376.8985 1379.8866 1389.7426 1394.8678 1438.3354 1464.4871 1467.6422 1476.1605 1485.0900 1490.0787 1502.4288 1509.6149 1582.1274 1613.7160 2911.8350 2974.4601 2987.9390 2998.3045 3034.7751 3064.5411 3076.6840 3083.3664 3097.2316 3097.8213 3104.3069 3131.1037 3155.7725 3169.2816 3572.9462
redmass: 3.6541 2.8429 2.9169 2.9670 2.9769 1.2325 1.0795 2.8289 2.7977 3.1344 1.2090 3.2845 2.7064 3.3287 3.2593 3.3635 3.9785 4.8103 3.8051 4.4477 3.8802 1.2500 1.6430 1.1471 2.1862 1.4579 2.1048 1.5105 2.1464 1.2928 3.4078 2.1038 2.2493 2.0585 2.0203 1.7740 1.5142 1.5844 1.1577 2.0244 2.3355 1.5454 1.2049 1.4878 1.4770 1.2665 1.2258 1.7210 1.2928 2.9945 2.6873 1.0475 1.0440 1.0465 1.0547 1.0710 2.0243 1.3168 6.2338 6.4854 1.0712 1.0350 1.0362 1.0687 1.0888 1.0992 1.0982 1.0984 1.1002 1.0893 1.0978 1.0865 1.0924 1.0989 1.0658
irintensity: 1.0036 0.5831 2.0975 0.9812 0.6073 0.4212 0.4701 6.6703 8.0591 5.3442 111.1002 3.2899 2.8604 20.0307 4.4108 2.3160 4.4888 0.8299 3.9118 3.1763 1.8779 111.4788 9.6657 6.4158 17.1123 1.8995 5.5509 3.1074 4.5471 0.1645 9.9421 12.0915 57.4464 75.4411 4.2621 36.9879 45.0923 57.2297 24.0353 43.4530 13.4808 103.3172 23.4262 29.3256 57.1868 8.8367 19.2951 7.0451 23.3305 6.4826 18.9121 11.9881 10.8864 0.7348 2.0535 13.7147 73.6639 66.7982 6.5448 77.6808 74.3588 33.1022 33.0951 55.6958 25.4839 29.1215 50.3815 46.5511 30.5587 23.4058 13.3513 8.2387 27.2913 16.3707 21.8190
temp: 298.150 k
press: 1.00000 atm
elementType: 8 7 6 6 6 6 6 6 6 6 6 6 1 1 1 1 1 1 1 1 1 1 1 1 1 1 1
symmnumber: 1
zpe: 602689.4 jmol-1
zpe.correction: 0.229552 hartree
zpe.thermalcorrener: 0.242126 hartree
zpe.thermalcorrenthalpy: 0.243071 hartree
zpe.thermalcorrgfe: 0.190984 hartree
zpe.sumelectzpe: -519.095491 hartree
zpe.sumelectthermal: -519.082916 hartree
zpe.sumelectthermalent: -519.081972 hartree
zpe.sumelectthermalfe: -519.134059 hartree
dipole: -0.2193 -0.6215 0.0389
dipole: 0.6602
quadrupole: -64.8615 -66.9352 -75.7930
quadrupole: -4.9261 -2.6685 4.5440
quadrupole: 4.3351 2.2614 -6.5964 -4.9261 -2.6685 4.5440
hfenergy: -519.3250428 hartree
pointgroup: C01 [X(C10H15N1O1)]
dipole: 0.0929705 -0.0468165 0.2379745 debye
polarizability: 158.003811|-1.2490596|81.9674992|1.6441391|11.2686175|121.6322369 unknown
InChI: InChI=1S/C10H15NO/c1-3-11(4-2)9-7-5-6-8-10(9)12/h5-8,12H,3-4H2,1-2H3
charge 0 multiplicity 1
27 atoms
O  -0.360479 1.109553 2.157979
N  1.341338 0.167965 0.058533
C  2.032979 -0.254269 1.306224
C  2.153407 0.064902 -1.175859
C  -0.067825 0.06778 -0.038946
C  -0.942431 0.521416 1.006526
C  2.199113 -1.789373 1.429534
C  1.965378 1.269052 -2.122633
C  -0.708702 -0.436645 -1.211794
C  -2.34428 0.423097 0.891473
C  -2.112541 -0.511368 -1.337718
C  -2.94569 -0.090415 -0.280072
H  3.02692 0.232859 1.318707
H  1.469081 0.134016 2.167028
H  3.211013 0.026514 -0.856723
H  1.967616 -0.886232 -1.725587
H  1.213233 -2.288615 1.43298
H  2.792645 -2.205278 0.594208
H  2.716366 -2.044601 2.373748
H  0.916199 1.370045 -2.448914
H  2.251464 2.203735 -1.60991
H  2.596502 1.152002 -3.023498
H  -0.091555 -0.793073 -2.04139
H  -2.973687 0.776359 1.720891
H  -2.548685 -0.909678 -2.260433
H  -4.035669 -0.149443 -0.359939
H  -1.073611 1.438595 2.759885
