program: Gaussian 09
title: 000118805
version: EM64L-G09RevD.01
frameworkgroup: C1[X(C15H24O3S)]
method: RPBEPBE
basis: SDD
operation: Freq
keyword: #p
keyword: freq=noraman
keyword: PBEPBE/SDD
title: #p freq=noraman PBEPBE/SDD
converged: YES YES NO NO
title: Mulliken charges:
elementType: S O O O C C C C C C C C C C C C C C C H H H H H H H H H H H H H H H H H H H H H H H H
charge: 0.992610 -0.569472 -0.505999 -0.505836 -0.387405 -0.381340 -0.365962 -0.372547 -0.388934 -0.353374 -0.575290 -0.356421 0.528530 -0.695918 -0.401256 -0.381072 -0.061121 -0.234274 -0.241454 0.196445 0.196773 0.192981 0.193083 0.196019 0.195028 0.190554 0.190491 0.215529 0.213096 0.187950 0.188049 0.214991 0.215871 0.195153 0.195224 0.216044 0.209773 0.209699 0.249783 0.249283 0.281598 0.281560 0.381557
chargesum: 0.00000
title: Mulliken charges with hydrogens summed into heavy atoms:
elementType: S O O O C C C C C C C C C C C C C C C
charge: 0.992610 -0.187915 -0.505999 -0.505836 0.005813 0.004725 0.025085 0.008498 0.039691 0.022625 -0.144427 0.033955 0.528530 -0.060402 -0.151472 -0.131790 -0.061121 0.047324 0.040106
polarizability: 2.82118422e+02 2.16221284e+01 1.55437828e+02 -3.64479310e+00 5.40631710e+00 1.72072258e+02
1716.lowfreq: -33.4217 -5.4262 0.0010 0.0016 0.0019 2.3646 8.3586 15.2964 19.9169
frequency: -27.9779 12.9976 19.8440 28.2478 38.6430 53.0962 63.4807 79.7076 95.5164 110.9911 125.7224 136.5711 139.2743 145.6668 157.1381 171.5974 220.1468 232.8366 241.3806 269.4198 285.1950 315.7472 322.2737 356.6696 384.2170 388.6576 407.8958 426.3307 455.9708 475.8805 531.7735 553.6097 620.1204 630.9941 718.3904 723.4039 725.6891 737.1099 765.5308 797.9057 814.5355 834.2323 848.5513 853.2049 878.9963 887.3880 946.9073 966.1498 967.0991 985.5368 989.6610 990.0846 994.5098 1009.8230 1036.1279 1045.9254 1049.2729 1057.6616 1069.1982 1075.2293 1080.9969 1082.1099 1119.5561 1126.1801 1183.3485 1184.5300 1207.7037 1213.0250 1214.7858 1245.7201 1246.3833 1271.5122 1278.4233 1279.3982 1284.0081 1291.9378 1293.8189 1302.0610 1309.0835 1331.7732 1346.3573 1352.6593 1353.7804 1388.4973 1389.5874 1400.9804 1458.7809 1459.0501 1463.0580 1464.1653 1468.6900 1471.4593 1476.0590 1477.6016 1482.0747 1487.0784 1489.2082 1592.1168 1593.4495 2949.1422 2949.7963 2951.4916 2955.0238 2961.3606 2966.9878 2971.4172 2971.5509 2982.3081 2984.1556 2987.9754 2996.2575 3008.4079 3019.8053 3029.4455 3039.4289 3052.7828 3067.9846 3070.7158 3136.3817 3138.9438 3164.5867 3167.4134 3480.2946
redmass: 1.6242 4.7959 5.5049 3.9981 4.0863 4.5322 1.8562 2.4150 5.4281 1.8963 2.9235 3.0894 4.4565 2.1709 5.4536 1.4693 3.8272 1.1222 6.6961 2.8540 4.7714 5.0904 4.5159 3.9779 4.5729 4.0942 2.8788 7.9769 3.3532 3.1637 3.9578 6.6944 6.9031 5.1437 1.0605 1.0777 3.5816 1.1031 1.1539 3.6113 1.2156 10.3913 1.2424 1.7590 1.2463 1.9103 1.2338 11.5825 1.4621 1.3889 3.7953 4.9927 4.7076 1.1441 3.6153 1.3899 3.0757 1.8368 2.7201 1.3105 2.2135 2.1934 2.6348 1.2552 1.7952 1.1387 1.2805 1.5391 2.4295 1.3442 1.3368 1.2046 1.0644 1.3186 1.0913 1.1238 1.1129 1.2373 1.3716 1.4076 1.5322 1.6774 1.6343 1.2166 7.6372 2.6788 1.0761 1.0725 1.0659 1.1326 1.3266 1.5270 1.0974 1.0464 1.0883 1.0869 1.1014 6.0788 7.4186 1.0584 1.0585 1.0589 1.0592 1.0589 1.0588 1.0584 1.0367 1.0963 1.0595 1.0979 1.1004 1.1025 1.1033 1.1043 1.1046 1.1047 1.1007 1.0993 1.0894 1.0895 1.0955 1.0968 1.0661
irintensity: 0.0150 0.7190 0.4806 0.8356 1.1380 0.1535 0.0405 0.0202 0.1880 0.0694 0.1176 0.5582 0.5852 0.1456 1.0210 53.9528 1.9862 0.1097 10.9511 54.2311 5.5465 14.9889 15.6242 6.9896 2.5954 1.8335 0.0367 58.0338 2.9476 1.6054 40.3719 138.8028 0.0375 49.1897 15.3820 0.0439 1.0932 4.0823 0.2612 2.3581 0.7976 95.4695 0.5911 36.1779 0.8161 4.1300 0.2601 93.4821 3.8995 0.1970 1.2282 0.0911 3.7698 0.0303 0.2682 37.9995 3.2966 75.7597 0.8220 0.2506 0.2036 0.7504 21.5863 5.3869 0.1257 6.8864 21.3514 1.4039 5.6635 1.3311 0.9158 0.1525 0.4384 1.8901 0.0103 0.1400 0.2824 1.0649 2.6471 1.2119 1.2908 0.2103 0.2929 11.3118 4.5692 11.8196 0.0657 0.0689 0.1307 1.3703 3.6623 17.3848 0.6086 11.8166 2.6489 6.1025 32.2644 26.8516 0.5879 0.0779 0.0996 4.1095 0.1510 39.4118 131.1879 45.5417 35.0711 0.1228 67.2290 0.4394 0.4339 1.0532 0.2805 2.1971 118.2708 105.3971 95.8556 54.0259 10.4309 6.5462 0.2611 8.0098 40.5242
temp: 298.150 k
press: 1.00000 atm
elementType: 16 8 8 8 6 6 6 6 6 6 6 6 6 6 6 6 6 6 6 1 1 1 1 1 1 1 1 1 1 1 1 1 1 1 1 1 1 1 1 1 1 1 1
symmnumber: 1
zpe: 941642.9 jmol-1
zpe.correction: 0.358653 hartree
zpe.thermalcorrener: 0.380707 hartree
zpe.thermalcorrenthalpy: 0.381651 hartree
zpe.thermalcorrgfe: 0.303451 hartree
zpe.sumelectzpe: -1208.065117 hartree
zpe.sumelectthermal: -1208.043063 hartree
zpe.sumelectthermalent: -1208.042118 hartree
zpe.sumelectthermalfe: -1208.120318 hartree
dipole: -5.7927 -0.4940 -0.1135
dipole: 5.8148
quadrupole: -165.6259 -122.2000 -122.2845
quadrupole: 7.5332 -2.4759 0.1209
quadrupole: -28.9224 14.5035 14.4189 7.5332 -2.4759 0.1209
hfenergy: -1208.4237699 hartree
pointgroup: C01 [X(C15H24O3S1)]
dipole: 2.2748949 -0.2163895 0.1083132 debye
polarizability: 281.3671513|-23.8894769|154.6702778|2.0847041|-1.7755621|173.5910788 unknown
InChI: InChI=1S/C15H24O3S/c1-2-3-4-5-6-7-8-9-14-10-12-15(13-11-14)19(16,17)18/h10-13,16H,2-9H2,1H3
charge 0 multiplicity 1
43 atoms
S  -5.932241 0.743546 -0.201046
O  -5.411015 2.530312 -0.202078
O  -6.59168 0.405765 -1.639907
O  -6.751695 0.454568 1.164872
C  3.363832 0.058611 -0.046587
C  4.807558 -0.479676 0.073796
C  2.288547 -1.039737 0.112527
C  5.883977 0.616652 -0.092057
C  0.847614 -0.493463 0.010221
C  7.328101 0.081664 0.036906
C  -0.227648 -1.608394 0.158573
C  8.404401 1.178317 -0.132203
C  -1.641136 -1.059465 0.073043
C  9.844082 0.635625 -0.001632
C  -2.374358 -0.754655 1.250452
C  -2.240655 -0.805483 -1.190248
C  -4.206932 0.037378 -0.091253
C  -3.669714 -0.197873 1.183688
C  -3.533397 -0.250022 -1.289294
H  3.238575 0.555022 -1.03149
H  3.201607 0.844909 0.719951
H  4.9345 -0.970866 1.061331
H  4.969396 -1.270087 -0.688918
H  2.421681 -1.544287 1.092451
H  2.442887 -1.820007 -0.662144
H  5.76111 1.10421 -1.081947
H  5.718896 1.410124 0.66684
H  0.683464 0.275895 0.791259
H  0.710117 0.017608 -0.964062
H  7.494907 -0.713145 -0.720284
H  7.453669 -0.403165 1.027862
H  -0.075768 -2.120543 1.128111
H  -0.062829 -2.363671 -0.634852
H  8.23733 1.972114 0.6245
H  8.278171 1.662223 -1.122334
H  10.593563 1.439473 -0.121913
H  10.048521 -0.134754 -0.769143
H  10.003454 0.170446 0.989664
H  -1.927924 -0.955124 2.230999
H  -1.691166 -1.047996 -2.107117
H  -4.248868 0.028371 2.084321
H  -4.01021 -0.063232 -2.256496
H  -6.243524 3.084313 -0.259361
