program: Gaussian 09
title: 000118810
version: EM64L-G09RevD.01
frameworkgroup: C1[X(C19H36)]
method: RPBEPBE
basis: SDD
operation: Freq
keyword: #p
keyword: freq=noraman
keyword: PBEPBE/SDD
title: #p freq=noraman PBEPBE/SDD
converged: YES YES NO NO
title: Mulliken charges:
elementType: C C C C C C C C C C C C C C C C C C C H H H H H H H H H H H H H H H H H H H H H H H H H H H H H H H H H H H H
charge: -0.376422 -0.388086 -0.384555 -0.366902 -0.366054 -0.366177 -0.025283 -0.354468 -0.379541 -0.372904 -0.367988 -0.356349 -0.488386 -0.708963 -0.714990 -0.490753 -0.696946 -0.036607 -0.034033 0.193871 0.198414 0.188682 0.193900 0.185393 0.195001 0.187452 0.188923 0.188218 0.212783 0.181708 0.188457 0.191163 0.186939 0.188062 0.182362 0.224715 0.207527 0.196830 0.194853 0.207838 0.194613 0.194902 0.225453 0.229745 0.208724 0.222201 0.198542 0.212035 0.211195 0.205760 0.230085 0.225151 0.209632 0.214715 0.209561
chargesum: 0.00000
title: Mulliken charges with hydrogens summed into heavy atoms:
elementType: C C C C C C C C C C C C C C C C C C C
charge: 0.015864 -0.005505 -0.004161 0.009473 0.034947 0.003988 0.165881 0.020532 0.027535 0.031453 0.034703 0.033166 -0.033188 -0.079496 -0.086000 -0.035516 -0.063037 -0.036607 -0.034033
polarizability: 2.36433691e+02 7.93959194e-01 2.21747320e+02 3.78584505e+00 -3.44734776e+00 1.60226030e+02
1716.lowfreq: -0.0007 -0.0005 0.0005 3.0092 3.7027 9.6039 14.6079 21.7552 28.4204
frequency: 14.4039 18.8783 28.3870 34.8108 42.7415 44.3316 50.7059 77.8775 80.4880 93.2639 112.9536 115.2724 122.2950 125.9105 138.3325 150.7280 159.0345 169.2761 203.1928 210.3157 229.3249 230.0748 237.7452 259.6726 270.9262 289.2567 323.6336 346.4656 371.4137 388.8096 417.5317 441.3206 455.8108 470.9892 516.9998 553.0084 673.4132 719.8511 723.4716 736.1958 740.6763 766.1163 803.7561 815.6005 830.1036 846.2572 860.7584 884.9131 888.9139 915.5433 924.9334 944.5178 952.9214 967.7177 984.2447 996.2510 1005.9165 1013.7677 1018.4443 1044.5710 1050.1904 1064.6723 1071.6771 1079.8726 1080.6050 1083.6245 1110.5636 1112.7938 1119.9991 1131.3285 1162.1025 1178.0445 1182.9532 1191.1018 1193.6823 1207.0644 1213.5042 1225.5179 1247.6425 1256.3292 1258.6102 1271.7155 1275.6695 1279.9296 1287.9108 1289.4816 1292.1652 1295.9253 1298.3163 1305.3880 1316.7556 1320.1798 1325.2036 1332.5426 1342.0234 1343.7826 1353.8307 1356.6292 1359.4444 1361.3659 1375.4821 1389.4952 1392.8144 1455.0281 1456.0812 1456.4450 1459.2980 1459.9243 1461.8036 1462.8712 1463.9102 1467.6242 1468.5751 1472.4024 1474.0597 1477.0056 1480.1138 1480.2284 1482.1376 1485.2960 1487.8239 1489.5097 2271.3761 2944.7669 2947.9016 2949.8182 2950.4006 2953.6288 2954.1307 2957.8102 2959.3166 2961.6302 2961.9771 2963.5119 2964.0931 2967.5557 2967.9751 2971.3204 2972.8714 2973.6176 2982.1798 2986.7679 2994.4405 2997.2038 3004.5473 3010.0545 3010.5354 3016.2727 3022.0945 3027.5612 3038.0846 3046.5415 3047.3715 3055.0494 3062.9019 3065.6695 3067.8560 3069.7259 3071.2477
redmass: 4.0704 2.8386 2.1848 2.2988 3.3871 2.7332 3.6911 2.1358 2.1143 3.1314 1.7930 2.4595 2.1014 2.7586 2.2878 2.1999 2.3399 2.4052 3.8260 1.1100 1.4038 1.8330 1.2680 1.9650 3.5051 2.7640 3.3137 2.7254 3.4595 2.5313 2.1973 2.9240 3.0759 2.9953 3.0009 2.9598 2.1909 1.0596 1.0766 1.1177 1.1814 1.2178 1.8770 1.5188 1.7619 1.6269 1.5380 1.4646 1.7191 1.1830 1.9092 1.6681 1.3876 1.6194 2.9450 2.9009 1.4717 2.1941 1.4856 2.9420 3.1603 2.7568 2.3629 2.1726 2.1761 2.1534 1.5462 1.5282 2.5103 2.1267 2.4680 1.7441 1.7343 1.3049 1.6903 1.2607 1.4554 1.3156 1.3299 1.3162 1.2771 1.2187 1.2250 1.0394 1.1243 1.1881 1.1010 1.1486 1.1106 1.3058 1.2987 1.3673 1.4823 1.4192 1.4981 1.4522 1.6944 1.6084 1.5971 1.5722 1.2243 1.2181 1.2154 1.0878 1.0694 1.0856 1.0749 1.0749 1.0767 1.0769 1.0674 1.0777 1.0504 1.0576 1.0816 1.0428 1.0841 1.0823 1.0660 1.0854 1.0740 1.0769 11.6897 1.0612 1.0585 1.0592 1.0586 1.0791 1.0593 1.0597 1.0631 1.0595 1.0597 1.0549 1.0404 1.0469 1.0481 1.0367 1.0620 1.0620 1.0959 1.0966 1.0995 1.0967 1.1007 1.0987 1.0999 1.1024 1.0990 1.1044 1.1046 1.1042 1.1037 1.0991 1.0990 1.0993 1.1007 1.0993 1.0986
irintensity: 0.0021 0.0055 0.0152 0.0025 0.0306 0.0292 0.0540 0.2402 0.2132 0.1670 0.8463 0.4914 0.1549 0.3060 0.1993 1.1051 1.2901 2.5467 0.2851 0.0963 0.1431 0.2865 0.9144 4.0950 2.3376 0.1053 3.0844 0.1660 0.0594 0.2370 0.3267 2.7174 0.4115 0.0488 2.3189 1.2208 0.0591 16.9515 0.1499 9.4233 3.2941 0.0050 1.0100 3.5384 3.9041 0.9838 0.1432 1.1200 4.8902 4.9909 2.1270 1.5910 0.1556 0.6135 1.1184 0.5251 2.4719 0.4162 0.2621 1.5245 1.1552 5.9350 0.1816 0.2164 0.5137 1.5379 0.9088 1.7901 8.7020 1.0933 0.4781 8.2309 0.4613 5.5697 4.9047 1.7544 1.7762 2.4387 0.1390 0.6408 0.3570 2.3239 0.3178 0.1363 0.2406 0.5525 1.0209 0.1367 0.4742 1.1857 1.8963 3.9253 7.4225 6.8758 5.1123 2.0597 0.6098 0.0931 3.2115 1.3868 28.2827 11.5288 14.5499 3.7677 0.5569 14.5822 0.2364 0.1790 0.2138 4.1565 0.5415 0.9226 0.4198 5.7772 0.9886 12.1733 6.6178 2.4366 5.7782 11.8811 38.1575 7.2449 0.5408 16.5364 1.8629 0.5939 1.6056 12.0250 3.0919 2.4255 19.2604 46.4318 28.8324 60.8993 37.0678 89.2537 92.8762 36.0416 136.5419 35.7361 1.0039 3.2394 0.3410 18.2861 1.1526 23.2871 21.4528 10.1345 14.9620 2.8485 66.2068 277.8107 47.7140 5.0141 100.2669 54.5386 98.1312 52.4102 55.8761
temp: 298.150 k
press: 1.00000 atm
elementType: 6 6 6 6 6 6 6 6 6 6 6 6 6 6 6 6 6 6 6 1 1 1 1 1 1 1 1 1 1 1 1 1 1 1 1 1 1 1 1 1 1 1 1 1 1 1 1 1 1 1 1 1 1 1 1
symmnumber: 1
zpe: 1318003.1 jmol-1
zpe.correction: 0.502001 hartree
zpe.thermalcorrener: 0.527741 hartree
zpe.thermalcorrenthalpy: 0.528685 hartree
zpe.thermalcorrgfe: 0.442057 hartree
zpe.sumelectzpe: -743.998863 hartree
zpe.sumelectthermal: -743.973123 hartree
zpe.sumelectthermalent: -743.972179 hartree
zpe.sumelectthermalfe: -744.058807 hartree
dipole: 0.0748 0.1241 0.0479
dipole: 0.1526
quadrupole: -125.1857 -118.2915 -123.3109
quadrupole: -4.5699 -0.7663 1.1120
quadrupole: -2.9230 3.9712 -1.0482 -4.5699 -0.7663 1.1120
hfenergy: -744.5008638 hartree
pointgroup: C01 [X(C19H36)]
dipole: 0.0307367 -0.0482714 -0.018182 debye
polarizability: 236.4389878|-0.4560306|221.5870526|-3.9566542|-4.5183496|160.3810009 unknown
InChI: InChI=1S/C19H36/c1-4-5-6-7-8-9-10-11-12-13-14-15-16-17-18-19(2)3/h19H,4-12,15-18H2,1-3H3
charge 0 multiplicity 1
55 atoms
C  1.649876 1.510349 0.304518
C  3.046886 1.44732 -0.352641
C  0.631252 2.357277 -0.491413
C  4.053244 0.578981 0.436057
C  -0.765977 2.402741 0.166491
C  -2.061935 -3.016754 0.371888
C  -0.870423 -3.405953 -0.544533
C  5.453892 0.516258 -0.213667
C  -2.942238 -1.866784 -0.167998
C  -1.78286 3.250569 -0.62712
C  -4.173769 -1.589154 0.720967
C  6.457392 -0.353641 0.577763
C  -3.196775 3.292181 0.022582
C  0.160854 -2.259479 -0.680339
C  -0.182047 -4.690045 -0.02244
C  -5.082854 -0.44673 0.18126
C  7.855072 -0.410235 -0.076127
C  -3.862069 1.974605 0.084033
C  -4.417374 0.870851 0.124098
H  1.745406 1.921722 1.331354
H  1.254115 0.479595 0.418258
H  3.452129 2.475979 -0.455606
H  2.948804 1.047483 -1.38376
H  1.021475 3.391013 -0.60341
H  0.538982 1.947293 -1.519186
H  3.648032 -0.450482 0.533153
H  4.146441 0.974332 1.469512
H  -0.675136 2.808033 1.196348
H  -1.159448 1.371436 0.271209
H  -2.699304 -3.91386 0.52218
H  -1.668588 -2.742676 1.374337
H  -1.279781 -3.621575 -1.55538
H  5.860625 1.544843 -0.311187
H  5.362825 0.119893 -1.24684
H  -3.282003 -2.117757 -1.195377
H  -2.350074 -0.935231 -0.2517
H  -1.871423 2.854475 -1.657915
H  -1.409952 4.291654 -0.713215
H  -4.787334 -2.509719 0.802811
H  -3.840937 -1.332388 1.745962
H  6.546357 0.042652 1.61009
H  6.050588 -1.381156 0.674147
H  -3.110512 3.708098 1.047519
H  -3.838271 3.995336 -0.545877
H  1.004705 -2.561952 -1.328537
H  -0.287609 -1.348147 -1.115738
H  0.575788 -1.994378 0.312236
H  -0.896869 -5.531993 0.042555
H  0.649093 -4.998744 -0.683999
H  0.236912 -4.523952 0.989317
H  -5.98574 -0.368564 0.819815
H  -5.440661 -0.72064 -0.832588
H  7.797382 -0.829981 -1.098355
H  8.552191 -1.038779 0.508334
H  8.296743 0.601282 -0.154744
