program: Gaussian 09
title: 000118786
version: EM64L-G09RevD.01
frameworkgroup: C1[X(C10H18O2)]
method: RPBEPBE
basis: SDD
operation: Freq
keyword: #pfreq=noraman
keyword: PBEPBE/SDD
title: #p freq=noraman PBEPBE/SDD
converged: YES YES NO NO
title: Mulliken charges:
elementType: O O C C C C C C C C C C H H H H H H H H H H H H H H H H H H
charge: -0.437402 -0.267528 -0.370291 -0.371226 -0.354551 -0.476870 -0.354138 0.416518 -0.695995 -0.815576 -0.418313 0.142554 0.185852 0.185355 0.200209 0.203268 0.189248 0.189172 0.221139 0.213889 0.194511 0.195081 0.210456 0.210578 0.216372 0.297661 0.230211 0.219731 0.265631 0.374451
chargesum: 0.00000
title: Mulliken charges with hydrogens summed into heavy atoms:
elementType: O O C C C C C C C C C C
charge: -0.062951 -0.267528 0.000917 0.032251 0.023869 -0.041842 0.035454 0.416518 -0.058589 -0.067972 -0.152681 0.142554
polarizability: 1.50949374e+02 9.36281689e+00 1.27068063e+02 -1.01823941e+00 6.52498237e-01 8.01097051e+01
1716.lowfreq: -13.1540 -6.3563 -0.0008 -0.0007 -0.0005 3.7656 31.7946 46.9342 52.7781
frequency: 31.6117 46.9264 52.6905 62.1976 73.3650 100.7800 119.4062 132.9356 141.2277 183.9825 216.9951 231.4048 237.8121 318.6476 369.3614 415.5208 454.0046 489.8447 502.8843 591.8045 638.9105 697.2939 722.5543 733.3450 775.1756 831.7320 852.9614 889.2604 902.6357 935.6298 974.5237 980.7382 1011.2454 1022.7033 1046.5099 1060.0608 1071.4391 1084.8228 1119.6140 1120.7495 1192.5883 1195.9823 1226.0055 1247.4253 1260.6909 1278.8541 1285.1194 1289.3955 1293.7076 1327.2021 1345.9196 1355.0430 1385.1938 1389.7563 1396.0377 1438.2457 1455.2086 1463.0926 1465.1189 1473.6300 1477.3438 1481.4963 1482.2067 1488.9049 1634.7268 1657.7784 2940.5796 2950.6430 2955.8581 2966.7742 2969.8224 2971.9437 2972.4224 2976.9526 2987.5240 3003.5977 3025.9691 3040.4616 3042.2073 3068.7342 3071.5042 3124.4634 3166.7390 3522.6203
redmass: 3.9001 2.0776 2.6248 3.2644 1.5654 1.7523 1.8092 1.9480 3.7537 3.1214 5.8552 1.1205 3.1869 3.2169 4.6730 3.3837 2.2629 3.1221 3.9576 1.1759 4.3612 2.4125 1.0846 1.2359 1.2762 3.8874 1.3453 1.9332 1.3247 5.1461 1.6463 1.4034 3.6788 1.2813 2.5982 2.1105 2.4307 2.0633 1.6816 2.3648 1.8692 1.6051 1.2952 1.3045 1.7995 1.0914 1.4820 1.1195 1.0979 1.5447 1.5818 1.6691 1.4087 1.2163 1.4609 1.0807 1.1054 1.0671 1.0759 1.0711 1.0425 1.0536 1.0768 1.0892 7.2726 5.9798 1.0596 1.0588 1.0588 1.0591 1.0434 1.0549 1.0379 1.0948 1.0977 1.1013 1.1040 1.0966 1.1025 1.1007 1.0993 1.0974 1.0903 1.0640
irintensity: 0.5545 0.0451 0.1038 0.6414 1.4713 0.0790 0.2771 0.1389 0.1455 1.7328 1.1815 0.0194 0.8476 2.8407 3.7631 4.0549 1.3113 7.7741 12.6403 137.9553 20.0119 32.4819 8.8522 2.9588 0.2044 5.9162 14.9297 3.8022 11.8117 47.2116 46.8332 22.7565 22.3173 3.0325 167.0235 120.6751 10.2597 4.6965 2.3733 9.5823 9.4102 0.2932 2.3512 0.0439 14.6307 0.1083 6.4538 0.4727 0.4147 12.1366 9.5293 1.4873 20.7488 12.2579 29.8767 19.0028 69.8890 3.4018 0.3676 1.6368 12.3616 19.2425 1.9545 22.2536 237.9761 186.7617 13.5348 4.1566 8.9573 36.6732 0.9161 96.4509 59.4587 11.3654 0.0587 0.0293 5.2708 3.9476 127.4311 92.0634 53.9837 1.7195 4.2444 37.8667
temp: 298.150 k
press: 1.00000 atm
elementType: 8 8 6 6 6 6 6 6 6 6 6 6 1 1 1 1 1 1 1 1 1 1 1 1 1 1 1 1 1 1
symmnumber: 1
zpe: 681816.4 jmol-1
zpe.correction: 0.259690 hartree
zpe.thermalcorrener: 0.274851 hartree
zpe.thermalcorrenthalpy: 0.275795 hartree
zpe.thermalcorrgfe: 0.215399 hartree
zpe.sumelectzpe: -541.340951 hartree
zpe.sumelectthermal: -541.325791 hartree
zpe.sumelectthermalent: -541.324847 hartree
zpe.sumelectthermalfe: -541.385243 hartree
dipole: 2.4849 0.7738 -0.0477
dipole: 2.6030
quadrupole: -85.5429 -70.9944 -74.6781
quadrupole: 4.2255 0.2199 0.0608
quadrupole: -8.4711 6.0774 2.3937 4.2255 0.2199 0.0608
hfenergy: -541.6006416 hartree
pointgroup: C01 [X(C10H18O2)]
dipole: 0.9801603 -0.2967759 -0.0018211 debye
polarizability: 151.1050257|-9.1594254|126.9263578|-0.5049583|0.7619262|80.0957588 unknown
InChI: InChI=1S/C10H18O2/c1-3-4-5-6-7-9(2)8-10(11)12/h8,11H,3-7H2,1-2H3
charge 0 multiplicity 1
30 atoms
O  -3.431588 2.287633 0.165031
O  -4.49149 0.225433 0.075637
C  2.353127 -0.666366 0.060325
C  0.899704 -0.139786 0.050092
C  3.408726 0.456517 -0.049038
C  -0.133752 -1.281749 0.12899
C  4.861941 -0.070438 -0.028784
C  -1.611911 -0.913913 0.102304
C  5.912613 1.053813 -0.153534
C  -2.55417 -2.099375 0.047991
C  -2.018925 0.39653 0.122878
C  -3.411575 0.873545 0.115536
H  2.529027 -1.244679 0.991773
H  2.491922 -1.380154 -0.77901
H  0.761086 0.555133 0.902872
H  0.731002 0.45263 -0.871835
H  3.269582 1.17662 0.784447
H  3.240504 1.029041 -0.985047
H  0.046308 -1.873612 1.053452
H  0.049176 -1.998885 -0.700874
H  4.996686 -0.797185 -0.856074
H  5.031351 -0.635054 0.910889
H  5.782354 1.613971 -1.09869
H  5.821363 1.776851 0.679075
H  6.941802 0.650384 -0.138861
H  -3.60313 -1.806885 0.195204
H  -2.468818 -2.59853 -0.938278
H  -2.264644 -2.852421 0.805959
H  -1.278291 1.20009 0.15206
H  -4.381378 2.58534 0.160212
