program: Gaussian 09
title: 000118785
version: EM64L-G09RevD.01
frameworkgroup: C1[X(C6H10N2)]
method: RPBEPBE
basis: SDD
operation: Freq
keyword: #pfreq=noraman
keyword: PBEPBE/SDD
title: #p freq=noraman PBEPBE/SDD
converged: YES YES NO NO
title: Mulliken charges:
elementType: N N C C C C C C H H H H H H H H H H
charge: -0.101530 -0.102710 -0.342947 -0.347947 -0.671105 -0.189046 -0.206506 -0.321287 0.211990 0.220097 0.219989 0.216261 0.212462 0.227912 0.210899 0.258648 0.254888 0.249932
chargesum: 0.00000
title: Mulliken charges with hydrogens summed into heavy atoms:
elementType: N N C C C C C C
charge: -0.101530 -0.102710 0.089140 0.088303 -0.019831 0.069602 0.048382 -0.071355
polarizability: 9.40379772e+01 1.43356317e+00 7.41082939e+01 -6.66404360e+00 1.23509628e+00 5.03602865e+01
1716.lowfreq: -8.1258 -0.0007 -0.0006 -0.0004 8.5884 13.7595 42.6951 76.2533 106.7756
frequency: 42.4092 76.0993 106.7674 223.8237 288.5570 332.1820 363.8400 622.9690 653.5187 719.8505 724.3214 748.8781 774.1339 840.3910 870.1207 881.5636 891.9135 1009.8332 1048.1381 1054.5643 1093.6492 1111.0860 1113.8380 1215.4680 1220.4376 1262.4436 1280.5532 1302.4088 1333.7914 1356.0239 1365.7984 1395.2083 1439.4994 1466.4380 1475.7963 1480.2882 1483.2794 1492.7186 2978.5843 2991.7703 3001.6324 3036.4955 3061.0195 3079.7664 3083.9948 3220.4214 3227.4391 3248.9708
redmass: 2.2620 2.3073 4.0106 1.1002 2.8339 2.5590 4.2666 3.1115 3.4402 2.8138 1.4243 1.0935 1.4271 1.4126 1.2988 4.5329 1.8446 3.8819 2.2532 1.9041 1.8299 1.6947 2.0232 1.4782 1.7940 1.8694 1.2471 1.3046 5.1916 1.5715 2.1670 1.2109 2.3190 1.9767 1.1050 1.0574 1.3855 1.2076 1.0362 1.0603 1.0599 1.1004 1.1031 1.1032 1.0989 1.0909 1.0970 1.1098
irintensity: 1.4572 1.1147 0.6763 0.0080 0.4687 0.3481 1.2726 8.0693 15.6735 20.6573 17.1429 6.2922 73.7457 2.3970 2.5907 9.0467 11.9539 15.9211 8.8166 17.0098 0.6466 10.5460 8.3894 7.6205 20.9969 30.3518 2.6429 0.1389 1.1603 3.9347 6.4641 15.6075 37.8040 2.8927 0.5223 14.2119 11.5037 23.7029 31.3820 0.4857 64.9295 0.3205 0.1347 77.6074 37.7607 2.6674 2.8605 3.9138
temp: 298.150 k
press: 1.00000 atm
elementType: 7 7 6 6 6 6 6 6 1 1 1 1 1 1 1 1 1 1
symmnumber: 1
zpe: 401303.4 jmol-1
zpe.correction: 0.152848 hartree
zpe.thermalcorrener: 0.160937 hartree
zpe.thermalcorrenthalpy: 0.161881 hartree
zpe.thermalcorrgfe: 0.119245 hartree
zpe.sumelectzpe: -343.507776 hartree
zpe.sumelectthermal: -343.499688 hartree
zpe.sumelectthermalent: -343.498744 hartree
zpe.sumelectthermalfe: -343.541380 hartree
dipole: -4.6076 1.0876 0.9902
dipole: 4.8367
quadrupole: -56.9647 -45.1417 -50.7523
quadrupole: 5.2933 0.8468 -0.4932
quadrupole: -6.0118 5.8112 0.2006 5.2933 0.8468 -0.4932
hfenergy: -343.6606249 hartree
pointgroup: C01 [X(C6H10N2)]
dipole: 1.8124016 -0.5066815 0.2820124 debye
dipolederiv: -0.8755963 0.0217758 -0.1019064 -0.0098865 -0.0430785 0.0030613 -0.1675637 0.0116964 -0.182074 -0.6085401 0.0332806 -0.0425492 -0.0256484 -0.282888 0.006884 -0.101374 -0.000042 -0.2727465 0.6336849 0.0065118 0.0459974 0.0334676 0.2088727 -0.0213601 0.1111883 -0.0201116 0.2832082 -0.0270091 0.0008745 -0.0233738 0.0103266 0.131599 -0.0028968 -0.0275155 -0.0087475 0.0314838 -0.0751976 -0.0039264 -0.0025483 0.0025912 0.1047432 -0.0041546 0.0708236 -0.0036874 0.0578248 0.1869437 0.022236 0.0863097 0.2634659 -0.1042013 0.0520752 0.1558204 0.0124591 -0.1558861 0.5174116 -0.1172355 0.1242706 -0.2935951 0.0905367 -0.0039483 0.140544 0.006485 -0.0931631 0.0035128 0.0849042 0.0937124 0.0777034 0.1153197 0.0422054 0.067813 0.0748779 -0.1633824 0.0118684 -0.0013557 -0.0070767 -0.0537801 -0.0695425 -0.1231906 -0.0146575 -0.0650852 0.0232688 -0.0295996 0.013606 -0.0270647 0.0581553 -0.033262 0.1379759 -0.0421735 0.0782893 -0.026548 0.0275869 0.058462 -0.0371762 0.0494197 -0.040482 0.1231865 -0.0233963 0.0861729 -0.0279902 0.0274415 -0.0659931 -0.0253322 -0.0612167 -0.0828556 -0.1160914 -0.0152789 -0.0758705 0.0135363 0.0555731 -0.0121134 -0.0206555 -0.0713318 -0.1053922 -0.1110031 -0.0667769 -0.1076047 0.0343755 -0.0687672 0.0089395 0.1059778 0.0142641 0.1034505 -0.0171809 0.1430141 -0.0159406 -0.0639427 0.0574464 0.0115018 -0.0273217 0.057458 -0.057154 0.1303462 -0.0814409 0.125678 -0.0174735 0.0792757 0.1009172 -0.0316307 0.05843 0.0103646 -0.017699 -0.0404303 -0.0072391 0.2097732 0.0703474 -0.07044 -0.0491211 -0.051436 0.0093894 -0.0411536 -0.0487928 -0.0455803 0.1768759 0.0136175 -0.0919454 -0.0605114 -0.0583873 0.0445801 -0.037056 -0.0598031 -0.0457497 0.17286 unknown
polarizability: 94.0730055|-0.0918884|73.5027504|6.7124113|3.9279678|50.9308017 unknown
InChI: InChI=1S/C6H10N2/c1-2-4-8-5-3-7-6-8/h3,5-6H,2,4H2,1H3
charge 0 multiplicity 1
18 atoms
N  -0.258523 0.007189 0.343763
N  -2.359591 0.724947 -0.143967
C  1.174271 0.048184 0.689082
C  2.099754 -0.054094 -0.545746
C  3.589286 0.001348 -0.146255
C  -0.99429 -1.125652 -0.031618
C  -1.125522 1.095941 0.25484
C  -2.281797 -0.665999 -0.324319
H  1.365067 0.997441 1.223421
H  1.397012 -0.774127 1.395156
H  1.859626 0.769237 -1.244869
H  1.886453 -0.997963 -1.083073
H  3.835661 0.954515 0.358183
H  4.238937 -0.084993 -1.035018
H  3.851855 -0.823163 0.543262
H  -0.557092 -2.120955 -0.047269
H  -0.816436 2.111713 0.492339
H  -3.14727 -1.241266 -0.645013
